debian.org / О Debian Где взять Debian Поддержка Уголок разработчика Новости Wiki

Автор Тема: Проблемы со сборкой libcairo.  (Прочитано 1707 раз)

0 Пользователей и 1 Гость просматривают эту тему.

Оффлайн Squeezer

  • Topic Author
  • Сообщений: 51
Проблемы со сборкой libcairo.
« : 04 Декабрь 2011, 18:55:22 »
Не могу собрать пакет libcairo. Последовательность действий:
1)#aptitude -y install dpkg-dev devscripts fakeroot
2)#apt-get build-dep cairo
3)$apt-get source cairo
4)$cd cairo*
5)$dpkg-buildpackage -rfakeroot (выдает ошибку)

Полный лог:

dpkg-buildpackage: source package cairo
dpkg-buildpackage: source version 1.10.2-6.1
dpkg-buildpackage: source changed by Aurelien Jarno <aurel32@debian.org>
dpkg-buildpackage: host architecture i386
 dpkg-source --before-build cairo-1.10.2
 fakeroot debian/rules clean
dh_testdir
dh_testroot
[ ! -r src/cairo-features.h.orig ] || mv -f src/cairo-features.h.orig src/cairo-features.h
[ ! -r configure-common-stamp ] || patch -NRp1 < debian/ltmain_as-needed.patch
rm -f *-stamp
рм -рф /home/abulychev/constructor/cairo/cairo-1.10.2/debian/build /home/abulychev/constructor/cairo/cairo-1.10.2/debian/install
dh_autoreconf_clean
dh_clean
 dpkg-source -b cairo-1.10.2
dpkg-source: info: using source format `3.0 (quilt)'
dpkg-source: info: building cairo using existing ./cairo_1.10.2.orig.tar.gz
dpkg-source: info: building cairo in cairo_1.10.2-6.1.debian.tar.gz
dpkg-source: info: building cairo in cairo_1.10.2-6.1.dsc
 debian/rules build
dh_testdir
# Generated by configure and breaks the build if already existing
test -r src/cairo-features.h && \
     mv src/cairo-features.h src/cairo-features.h.orig
make: [configure-common-stamp] Ошибка 1 (игнорирована)
dh_autoreconf
configure.ac:16: warning: AC_LANG_CONFTEST: no AC_LANG_SOURCE call detected in body
../../lib/autoconf/lang.m4:194: AC_LANG_CONFTEST is expanded from...
../../lib/autoconf/general.m4:2662: _AC_LINK_IFELSE is expanded from...
../../lib/autoconf/general.m4:2679: AC_LINK_IFELSE is expanded from...
build/libtool.m4:1022: _LT_SYS_MODULE_PATH_AIX is expanded from...
build/libtool.m4:4170: _LT_LINKER_SHLIBS is expanded from...
build/libtool.m4:5253: _LT_LANG_C_CONFIG is expanded from...
build/libtool.m4:138: _LT_SETUP is expanded from...
build/libtool.m4:67: LT_INIT is expanded from...
build/libtool.m4:102: AC_PROG_LIBTOOL is expanded from...
configure.ac:16: the top level
configure.ac:16: warning: AC_LANG_CONFTEST: no AC_LANG_SOURCE call detected in body
../../lib/autoconf/lang.m4:194: AC_LANG_CONFTEST is expanded from...
../../lib/autoconf/general.m4:2662: _AC_LINK_IFELSE is expanded from...
../../lib/autoconf/general.m4:2679: AC_LINK_IFELSE is expanded from...
build/libtool.m4:4170: _LT_LINKER_SHLIBS is expanded from...
build/libtool.m4:5253: _LT_LANG_C_CONFIG is expanded from...
build/libtool.m4:138: _LT_SETUP is expanded from...
build/libtool.m4:67: LT_INIT is expanded from...
build/libtool.m4:102: AC_PROG_LIBTOOL is expanded from...
configure.ac:16: the top level
build/configure.ac.tools:7: warning: AC_LANG_CONFTEST: no AC_LANG_SOURCE call detected in body
../../lib/autoconf/lang.m4:194: AC_LANG_CONFTEST is expanded from...
../../lib/autoconf/general.m4:2662: _AC_LINK_IFELSE is expanded from...
../../lib/autoconf/general.m4:2679: AC_LINK_IFELSE is expanded from...
build/libtool.m4:1022: _LT_SYS_MODULE_PATH_AIX is expanded from...
build/libtool.m4:5360: _LT_LANG_CXX_CONFIG is expanded from...
build/libtool.m4:785: _LT_LANG is expanded from...
build/libtool.m4:768: LT_LANG is expanded from...
build/configure.ac.tools:7: the top level
build/configure.ac.warnings:39: warning: AC_LANG_CONFTEST: no AC_LANG_SOURCE call detected in body
../../lib/autoconf/lang.m4:194: AC_LANG_CONFTEST is expanded from...
../../lib/autoconf/general.m4:2662: _AC_LINK_IFELSE is expanded from...
../../lib/autoconf/general.m4:2679: AC_LINK_IFELSE is expanded from...
build/aclocal.cairo.m4:89: CAIRO_CC_TRY_LINK_WITH_ENV_SILENT is expanded from...
build/aclocal.cairo.m4:124: CAIRO_CC_TRY_FLAG_SILENT is expanded from...
build/aclocal.cairo.m4:131: CAIRO_CC_CHECK_WERROR is expanded from...
build/aclocal.cairo.m4:148: CAIRO_CC_TRY_FLAG is expanded from...
../../lib/m4sugar/m4sh.m4:606: AS_IF is expanded from...
../../lib/autoconf/general.m4:2032: AC_CACHE_VAL is expanded from...
../../lib/autoconf/general.m4:2053: AC_CACHE_CHECK is expanded from...
build/configure.ac.warnings:39: the top level
build/configure.ac.warnings:39: warning: AC_LANG_CONFTEST: no AC_LANG_SOURCE call detected in body
../../lib/autoconf/lang.m4:194: AC_LANG_CONFTEST is expanded from...
../../lib/autoconf/general.m4:2662: _AC_LINK_IFELSE is expanded from...
../../lib/autoconf/general.m4:2679: AC_LINK_IFELSE is expanded from...
build/aclocal.cairo.m4:89: CAIRO_CC_TRY_LINK_WITH_ENV_SILENT is expanded from...
build/aclocal.cairo.m4:124: CAIRO_CC_TRY_FLAG_SILENT is expanded from...
build/aclocal.cairo.m4:148: CAIRO_CC_TRY_FLAG is expanded from...
../../lib/m4sugar/m4sh.m4:606: AS_IF is expanded from...
../../lib/autoconf/general.m4:2032: AC_CACHE_VAL is expanded from...
../../lib/autoconf/general.m4:2053: AC_CACHE_CHECK is expanded from...
build/configure.ac.warnings:39: the top level
build/configure.ac.warnings:69: warning: AC_LANG_CONFTEST: no AC_LANG_SOURCE call detected in body
../../lib/autoconf/lang.m4:194: AC_LANG_CONFTEST is expanded from...
../../lib/autoconf/general.m4:2662: _AC_LINK_IFELSE is expanded from...
../../lib/autoconf/general.m4:2679: AC_LINK_IFELSE is expanded from...
build/aclocal.cairo.m4:89: CAIRO_CC_TRY_LINK_WITH_ENV_SILENT is expanded from...
build/aclocal.cairo.m4:124: CAIRO_CC_TRY_FLAG_SILENT is expanded from...
../../lib/m4sugar/m4sh.m4:606: AS_IF is expanded from...
../../lib/autoconf/general.m4:2032: AC_CACHE_VAL is expanded from...
../../lib/autoconf/general.m4:2053: AC_CACHE_CHECK is expanded from...
build/configure.ac.warnings:69: the top level
build/configure.ac.warnings:83: warning: AC_LANG_CONFTEST: no AC_LANG_SOURCE call detected in body
../../lib/autoconf/lang.m4:194: AC_LANG_CONFTEST is expanded from...
../../lib/autoconf/general.m4:2662: _AC_LINK_IFELSE is expanded from...
../../lib/autoconf/general.m4:2679: AC_LINK_IFELSE is expanded from...
build/aclocal.cairo.m4:89: CAIRO_CC_TRY_LINK_WITH_ENV_SILENT is expanded from...
build/aclocal.cairo.m4:124: CAIRO_CC_TRY_FLAG_SILENT is expanded from...
build/aclocal.cairo.m4:131: CAIRO_CC_CHECK_WERROR is expanded from...
build/aclocal.cairo.m4:148: CAIRO_CC_TRY_FLAG is expanded from...
../../lib/m4sugar/m4sh.m4:606: AS_IF is expanded from...
../../lib/autoconf/general.m4:2032: AC_CACHE_VAL is expanded from...
../../lib/autoconf/general.m4:2053: AC_CACHE_CHECK is expanded from...
build/configure.ac.warnings:83: the top level
build/configure.ac.warnings:83: warning: AC_LANG_CONFTEST: no AC_LANG_SOURCE call detected in body
../../lib/autoconf/lang.m4:194: AC_LANG_CONFTEST is expanded from...
../../lib/autoconf/general.m4:2662: _AC_LINK_IFELSE is expanded from...
../../lib/autoconf/general.m4:2679: AC_LINK_IFELSE is expanded from...
build/aclocal.cairo.m4:89: CAIRO_CC_TRY_LINK_WITH_ENV_SILENT is expanded from...
build/aclocal.cairo.m4:124: CAIRO_CC_TRY_FLAG_SILENT is expanded from...
build/aclocal.cairo.m4:148: CAIRO_CC_TRY_FLAG is expanded from...
../../lib/m4sugar/m4sh.m4:606: AS_IF is expanded from...
../../lib/autoconf/general.m4:2032: AC_CACHE_VAL is expanded from...
../../lib/autoconf/general.m4:2053: AC_CACHE_CHECK is expanded from...
build/configure.ac.warnings:83: the top level
build/configure.ac.analysis:75: warning: AC_LANG_CONFTEST: no AC_LANG_SOURCE call detected in body
../../lib/autoconf/lang.m4:194: AC_LANG_CONFTEST is expanded from...
../../lib/autoconf/general.m4:2662: _AC_LINK_IFELSE is expanded from...
../../lib/autoconf/general.m4:2679: AC_LINK_IFELSE is expanded from...
build/aclocal.cairo.m4:89: CAIRO_CC_TRY_LINK_WITH_ENV_SILENT is expanded from...
build/aclocal.cairo.m4:124: CAIRO_CC_TRY_FLAG_SILENT is expanded from...
build/aclocal.cairo.m4:131: CAIRO_CC_CHECK_WERROR is expanded from...
build/aclocal.cairo.m4:148: CAIRO_CC_TRY_FLAG is expanded from...
build/configure.ac.analysis:75: the top level
build/configure.ac.analysis:75: warning: AC_LANG_CONFTEST: no AC_LANG_SOURCE call detected in body
../../lib/autoconf/lang.m4:194: AC_LANG_CONFTEST is expanded from...
../../lib/autoconf/general.m4:2662: _AC_LINK_IFELSE is expanded from...
../../lib/autoconf/general.m4:2679: AC_LINK_IFELSE is expanded from...
build/aclocal.cairo.m4:89: CAIRO_CC_TRY_LINK_WITH_ENV_SILENT is expanded from...
build/aclocal.cairo.m4:124: CAIRO_CC_TRY_FLAG_SILENT is expanded from...
build/aclocal.cairo.m4:148: CAIRO_CC_TRY_FLAG is expanded from...
build/configure.ac.analysis:75: the top level
configure.ac:646: warning: AC_LANG_CONFTEST: no AC_LANG_SOURCE call detected in body
../../lib/autoconf/lang.m4:194: AC_LANG_CONFTEST is expanded from...
../../lib/autoconf/general.m4:2662: _AC_LINK_IFELSE is expanded from...
../../lib/autoconf/general.m4:2679: AC_LINK_IFELSE is expanded from...
build/aclocal.cairo.m4:89: CAIRO_CC_TRY_LINK_WITH_ENV_SILENT is expanded from...
build/configure.ac.pthread:136: CAIRO_CHECK_PTHREAD is expanded from...
build/configure.ac.pthread:189: CAIRO_CONFIGURE_PTHREAD is expanded from...
../../lib/m4sugar/m4sh.m4:606: AS_IF is expanded from...
../../lib/autoconf/general.m4:2032: AC_CACHE_VAL is expanded from...
../../lib/autoconf/general.m4:2053: AC_CACHE_CHECK is expanded from...
../../lib/m4sugar/m4sh.m4:517: AS_CASE is expanded from...
build/aclocal.enable.m4:41: _CAIRO_ENABLE is expanded from...
build/configure.ac.features:23: CAIRO_ENABLE is expanded from...
configure.ac:646: the top level
configure.ac:16: warning: AC_LANG_CONFTEST: no AC_LANG_SOURCE call detected in body
../../lib/autoconf/lang.m4:194: AC_LANG_CONFTEST is expanded from...
../../lib/autoconf/general.m4:2662: _AC_LINK_IFELSE is expanded from...
../../lib/autoconf/general.m4:2679: AC_LINK_IFELSE is expanded from...
build/libtool.m4:1022: _LT_SYS_MODULE_PATH_AIX is expanded from...
build/libtool.m4:4170: _LT_LINKER_SHLIBS is expanded from...
build/libtool.m4:5253: _LT_LANG_C_CONFIG is expanded from...
build/libtool.m4:138: _LT_SETUP is expanded from...
build/libtool.m4:67: LT_INIT is expanded from...
build/libtool.m4:102: AC_PROG_LIBTOOL is expanded from...
configure.ac:16: the top level
configure.ac:16: warning: AC_LANG_CONFTEST: no AC_LANG_SOURCE call detected in body
../../lib/autoconf/lang.m4:194: AC_LANG_CONFTEST is expanded from...
../../lib/autoconf/general.m4:2662: _AC_LINK_IFELSE is expanded from...
../../lib/autoconf/general.m4:2679: AC_LINK_IFELSE is expanded from...
build/libtool.m4:4170: _LT_LINKER_SHLIBS is expanded from...
build/libtool.m4:5253: _LT_LANG_C_CONFIG is expanded from...
build/libtool.m4:138: _LT_SETUP is expanded from...
build/libtool.m4:67: LT_INIT is expanded from...
build/libtool.m4:102: AC_PROG_LIBTOOL is expanded from...
configure.ac:16: the top level
build/configure.ac.tools:7: warning: AC_LANG_CONFTEST: no AC_LANG_SOURCE call detected in body
../../lib/autoconf/lang.m4:194: AC_LANG_CONFTEST is expanded from...
../../lib/autoconf/general.m4:2662: _AC_LINK_IFELSE is expanded from...
../../lib/autoconf/general.m4:2679: AC_LINK_IFELSE is expanded from...
build/libtool.m4:1022: _LT_SYS_MODULE_PATH_AIX is expanded from...
build/libtool.m4:5360: _LT_LANG_CXX_CONFIG is expanded from...
build/libtool.m4:785: _LT_LANG is expanded from...
build/libtool.m4:768: LT_LANG is expanded from...
build/configure.ac.tools:7: the top level
build/configure.ac.warnings:39: warning: AC_LANG_CONFTEST: no AC_LANG_SOURCE call detected in body
../../lib/autoconf/lang.m4:194: AC_LANG_CONFTEST is expanded from...
../../lib/autoconf/general.m4:2662: _AC_LINK_IFELSE is expanded from...
../../lib/autoconf/general.m4:2679: AC_LINK_IFELSE is expanded from...
build/aclocal.cairo.m4:89: CAIRO_CC_TRY_LINK_WITH_ENV_SILENT is expanded from...
build/aclocal.cairo.m4:124: CAIRO_CC_TRY_FLAG_SILENT is expanded from...
build/aclocal.cairo.m4:131: CAIRO_CC_CHECK_WERROR is expanded from...
build/aclocal.cairo.m4:148: CAIRO_CC_TRY_FLAG is expanded from...
../../lib/m4sugar/m4sh.m4:606: AS_IF is expanded from...
../../lib/autoconf/general.m4:2032: AC_CACHE_VAL is expanded from...
../../lib/autoconf/general.m4:2053: AC_CACHE_CHECK is expanded from...
build/configure.ac.warnings:39: the top level
build/configure.ac.warnings:39: warning: AC_LANG_CONFTEST: no AC_LANG_SOURCE call detected in body
../../lib/autoconf/lang.m4:194: AC_LANG_CONFTEST is expanded from...
../../lib/autoconf/general.m4:2662: _AC_LINK_IFELSE is expanded from...
../../lib/autoconf/general.m4:2679: AC_LINK_IFELSE is expanded from...
build/aclocal.cairo.m4:89: CAIRO_CC_TRY_LINK_WITH_ENV_SILENT is expanded from...
build/aclocal.cairo.m4:124: CAIRO_CC_TRY_FLAG_SILENT is expanded from...
build/aclocal.cairo.m4:148: CAIRO_CC_TRY_FLAG is expanded from...
../../lib/m4sugar/m4sh.m4:606: AS_IF is expanded from...
../../lib/autoconf/general.m4:2032: AC_CACHE_VAL is expanded from...
../../lib/autoconf/general.m4:2053: AC_CACHE_CHECK is expanded from...
build/configure.ac.warnings:39: the top level
build/configure.ac.warnings:69: warning: AC_LANG_CONFTEST: no AC_LANG_SOURCE call detected in body
../../lib/autoconf/lang.m4:194: AC_LANG_CONFTEST is expanded from...
../../lib/autoconf/general.m4:2662: _AC_LINK_IFELSE is expanded from...
../../lib/autoconf/general.m4:2679: AC_LINK_IFELSE is expanded from...
build/aclocal.cairo.m4:89: CAIRO_CC_TRY_LINK_WITH_ENV_SILENT is expanded from...
build/aclocal.cairo.m4:124: CAIRO_CC_TRY_FLAG_SILENT is expanded from...
../../lib/m4sugar/m4sh.m4:606: AS_IF is expanded from...
../../lib/autoconf/general.m4:2032: AC_CACHE_VAL is expanded from...
../../lib/autoconf/general.m4:2053: AC_CACHE_CHECK is expanded from...
build/configure.ac.warnings:69: the top level
build/configure.ac.warnings:83: warning: AC_LANG_CONFTEST: no AC_LANG_SOURCE call detected in body
../../lib/autoconf/lang.m4:194: AC_LANG_CONFTEST is expanded from...
../../lib/autoconf/general.m4:2662: _AC_LINK_IFELSE is expanded from...
../../lib/autoconf/general.m4:2679: AC_LINK_IFELSE is expanded from...
build/aclocal.cairo.m4:89: CAIRO_CC_TRY_LINK_WITH_ENV_SILENT is expanded from...
build/aclocal.cairo.m4:124: CAIRO_CC_TRY_FLAG_SILENT is expanded from...
build/aclocal.cairo.m4:131: CAIRO_CC_CHECK_WERROR is expanded from...
build/aclocal.cairo.m4:148: CAIRO_CC_TRY_FLAG is expanded from...
../../lib/m4sugar/m4sh.m4:606: AS_IF is expanded from...
../../lib/autoconf/general.m4:2032: AC_CACHE_VAL is expanded from...
../../lib/autoconf/general.m4:2053: AC_CACHE_CHECK is expanded from...
build/configure.ac.warnings:83: the top level
build/configure.ac.warnings:83: warning: AC_LANG_CONFTEST: no AC_LANG_SOURCE call detected in body
../../lib/autoconf/lang.m4:194: AC_LANG_CONFTEST is expanded from...
../../lib/autoconf/general.m4:2662: _AC_LINK_IFELSE is expanded from...
../../lib/autoconf/general.m4:2679: AC_LINK_IFELSE is expanded from...
build/aclocal.cairo.m4:89: CAIRO_CC_TRY_LINK_WITH_ENV_SILENT is expanded from...
build/aclocal.cairo.m4:124: CAIRO_CC_TRY_FLAG_SILENT is expanded from...
build/aclocal.cairo.m4:148: CAIRO_CC_TRY_FLAG is expanded from...
../../lib/m4sugar/m4sh.m4:606: AS_IF is expanded from...
../../lib/autoconf/general.m4:2032: AC_CACHE_VAL is expanded from...
../../lib/autoconf/general.m4:2053: AC_CACHE_CHECK is expanded from...
build/configure.ac.warnings:83: the top level
build/configure.ac.analysis:75: warning: AC_LANG_CONFTEST: no AC_LANG_SOURCE call detected in body
../../lib/autoconf/lang.m4:194: AC_LANG_CONFTEST is expanded from...
../../lib/autoconf/general.m4:2662: _AC_LINK_IFELSE is expanded from...
../../lib/autoconf/general.m4:2679: AC_LINK_IFELSE is expanded from...
build/aclocal.cairo.m4:89: CAIRO_CC_TRY_LINK_WITH_ENV_SILENT is expanded from...
build/aclocal.cairo.m4:124: CAIRO_CC_TRY_FLAG_SILENT is expanded from...
build/aclocal.cairo.m4:131: CAIRO_CC_CHECK_WERROR is expanded from...
build/aclocal.cairo.m4:148: CAIRO_CC_TRY_FLAG is expanded from...
build/configure.ac.analysis:75: the top level
build/configure.ac.analysis:75: warning: AC_LANG_CONFTEST: no AC_LANG_SOURCE call detected in body
../../lib/autoconf/lang.m4:194: AC_LANG_CONFTEST is expanded from...
../../lib/autoconf/general.m4:2662: _AC_LINK_IFELSE is expanded from...
../../lib/autoconf/general.m4:2679: AC_LINK_IFELSE is expanded from...
build/aclocal.cairo.m4:89: CAIRO_CC_TRY_LINK_WITH_ENV_SILENT is expanded from...
build/aclocal.cairo.m4:124: CAIRO_CC_TRY_FLAG_SILENT is expanded from...
build/aclocal.cairo.m4:148: CAIRO_CC_TRY_FLAG is expanded from...
build/configure.ac.analysis:75: the top level
configure.ac:646: warning: AC_LANG_CONFTEST: no AC_LANG_SOURCE call detected in body
../../lib/autoconf/lang.m4:194: AC_LANG_CONFTEST is expanded from...
../../lib/autoconf/general.m4:2662: _AC_LINK_IFELSE is expanded from...
../../lib/autoconf/general.m4:2679: AC_LINK_IFELSE is expanded from...
build/aclocal.cairo.m4:89: CAIRO_CC_TRY_LINK_WITH_ENV_SILENT is expanded from...
build/configure.ac.pthread:136: CAIRO_CHECK_PTHREAD is expanded from...
build/configure.ac.pthread:189: CAIRO_CONFIGURE_PTHREAD is expanded from...
../../lib/m4sugar/m4sh.m4:606: AS_IF is expanded from...
../../lib/autoconf/general.m4:2032: AC_CACHE_VAL is expanded from...
../../lib/autoconf/general.m4:2053: AC_CACHE_CHECK is expanded from...
../../lib/m4sugar/m4sh.m4:517: AS_CASE is expanded from...
build/aclocal.enable.m4:41: _CAIRO_ENABLE is expanded from...
build/configure.ac.features:23: CAIRO_ENABLE is expanded from...
configure.ac:646: the top level
libtoolize: putting auxiliary files in AC_CONFIG_AUX_DIR, `build'.
libtoolize: copying file `build/ltmain.sh'
libtoolize: putting macros in AC_CONFIG_MACRO_DIR, `build'.
libtoolize: copying file `build/libtool.m4'
libtoolize: copying file `build/ltoptions.m4'
libtoolize: copying file `build/ltsugar.m4'
libtoolize: copying file `build/ltversion.m4'
libtoolize: copying file `build/lt~obsolete.m4'
build/configure.ac.warnings:39: warning: AC_LANG_CONFTEST: no AC_LANG_SOURCE call detected in body
../../lib/autoconf/lang.m4:194: AC_LANG_CONFTEST is expanded from...
../../lib/autoconf/general.m4:2662: _AC_LINK_IFELSE is expanded from...
../../lib/autoconf/general.m4:2679: AC_LINK_IFELSE is expanded from...
build/aclocal.cairo.m4:89: CAIRO_CC_TRY_LINK_WITH_ENV_SILENT is expanded from...
build/aclocal.cairo.m4:124: CAIRO_CC_TRY_FLAG_SILENT is expanded from...
build/aclocal.cairo.m4:131: CAIRO_CC_CHECK_WERROR is expanded from...
build/aclocal.cairo.m4:148: CAIRO_CC_TRY_FLAG is expanded from...
../../lib/m4sugar/m4sh.m4:606: AS_IF is expanded from...
../../lib/autoconf/general.m4:2032: AC_CACHE_VAL is expanded from...
../../lib/autoconf/general.m4:2053: AC_CACHE_CHECK is expanded from...
build/configure.ac.warnings:39: the top level
build/configure.ac.warnings:39: warning: AC_LANG_CONFTEST: no AC_LANG_SOURCE call detected in body
../../lib/autoconf/lang.m4:194: AC_LANG_CONFTEST is expanded from...
../../lib/autoconf/general.m4:2662: _AC_LINK_IFELSE is expanded from...
../../lib/autoconf/general.m4:2679: AC_LINK_IFELSE is expanded from...
build/aclocal.cairo.m4:89: CAIRO_CC_TRY_LINK_WITH_ENV_SILENT is expanded from...
build/aclocal.cairo.m4:124: CAIRO_CC_TRY_FLAG_SILENT is expanded from...
build/aclocal.cairo.m4:148: CAIRO_CC_TRY_FLAG is expanded from...
../../lib/m4sugar/m4sh.m4:606: AS_IF is expanded from...
../../lib/autoconf/general.m4:2032: AC_CACHE_VAL is expanded from...
../../lib/autoconf/general.m4:2053: AC_CACHE_CHECK is expanded from...
build/configure.ac.warnings:39: the top level
build/configure.ac.warnings:69: warning: AC_LANG_CONFTEST: no AC_LANG_SOURCE call detected in body
../../lib/autoconf/lang.m4:194: AC_LANG_CONFTEST is expanded from...
../../lib/autoconf/general.m4:2662: _AC_LINK_IFELSE is expanded from...
../../lib/autoconf/general.m4:2679: AC_LINK_IFELSE is expanded from...
build/aclocal.cairo.m4:89: CAIRO_CC_TRY_LINK_WITH_ENV_SILENT is expanded from...
build/aclocal.cairo.m4:124: CAIRO_CC_TRY_FLAG_SILENT is expanded from...
../../lib/m4sugar/m4sh.m4:606: AS_IF is expanded from...
../../lib/autoconf/general.m4:2032: AC_CACHE_VAL is expanded from...
../../lib/autoconf/general.m4:2053: AC_CACHE_CHECK is expanded from...
build/configure.ac.warnings:69: the top level
build/configure.ac.warnings:83: warning: AC_LANG_CONFTEST: no AC_LANG_SOURCE call detected in body
../../lib/autoconf/lang.m4:194: AC_LANG_CONFTEST is expanded from...
../../lib/autoconf/general.m4:2662: _AC_LINK_IFELSE is expanded from...
../../lib/autoconf/general.m4:2679: AC_LINK_IFELSE is expanded from...
build/aclocal.cairo.m4:89: CAIRO_CC_TRY_LINK_WITH_ENV_SILENT is expanded from...
build/aclocal.cairo.m4:124: CAIRO_CC_TRY_FLAG_SILENT is expanded from...
build/aclocal.cairo.m4:131: CAIRO_CC_CHECK_WERROR is expanded from...
build/aclocal.cairo.m4:148: CAIRO_CC_TRY_FLAG is expanded from...
../../lib/m4sugar/m4sh.m4:606: AS_IF is expanded from...
../../lib/autoconf/general.m4:2032: AC_CACHE_VAL is expanded from...
../../lib/autoconf/general.m4:2053: AC_CACHE_CHECK is expanded from...
build/configure.ac.warnings:83: the top level
build/configure.ac.warnings:83: warning: AC_LANG_CONFTEST: no AC_LANG_SOURCE call detected in body
../../lib/autoconf/lang.m4:194: AC_LANG_CONFTEST is expanded from...
../../lib/autoconf/general.m4:2662: _AC_LINK_IFELSE is expanded from...
../../lib/autoconf/general.m4:2679: AC_LINK_IFELSE is expanded from...
build/aclocal.cairo.m4:89: CAIRO_CC_TRY_LINK_WITH_ENV_SILENT is expanded from...
build/aclocal.cairo.m4:124: CAIRO_CC_TRY_FLAG_SILENT is expanded from...
build/aclocal.cairo.m4:148: CAIRO_CC_TRY_FLAG is expanded from...
../../lib/m4sugar/m4sh.m4:606: AS_IF is expanded from...
../../lib/autoconf/general.m4:2032: AC_CACHE_VAL is expanded from...
../../lib/autoconf/general.m4:2053: AC_CACHE_CHECK is expanded from...
build/configure.ac.warnings:83: the top level
build/configure.ac.analysis:75: warning: AC_LANG_CONFTEST: no AC_LANG_SOURCE call detected in body
../../lib/autoconf/lang.m4:194: AC_LANG_CONFTEST is expanded from...
../../lib/autoconf/general.m4:2662: _AC_LINK_IFELSE is expanded from...
../../lib/autoconf/general.m4:2679: AC_LINK_IFELSE is expanded from...
build/aclocal.cairo.m4:89: CAIRO_CC_TRY_LINK_WITH_ENV_SILENT is expanded from...
build/aclocal.cairo.m4:124: CAIRO_CC_TRY_FLAG_SILENT is expanded from...
build/aclocal.cairo.m4:131: CAIRO_CC_CHECK_WERROR is expanded from...
build/aclocal.cairo.m4:148: CAIRO_CC_TRY_FLAG is expanded from...
build/configure.ac.analysis:75: the top level
build/configure.ac.analysis:75: warning: AC_LANG_CONFTEST: no AC_LANG_SOURCE call detected in body
../../lib/autoconf/lang.m4:194: AC_LANG_CONFTEST is expanded from...
../../lib/autoconf/general.m4:2662: _AC_LINK_IFELSE is expanded from...
../../lib/autoconf/general.m4:2679: AC_LINK_IFELSE is expanded from...
build/aclocal.cairo.m4:89: CAIRO_CC_TRY_LINK_WITH_ENV_SILENT is expanded from...
build/aclocal.cairo.m4:124: CAIRO_CC_TRY_FLAG_SILENT is expanded from...
build/aclocal.cairo.m4:148: CAIRO_CC_TRY_FLAG is expanded from...
build/configure.ac.analysis:75: the top level
configure.ac:646: warning: AC_LANG_CONFTEST: no AC_LANG_SOURCE call detected in body
../../lib/autoconf/lang.m4:194: AC_LANG_CONFTEST is expanded from...
../../lib/autoconf/general.m4:2662: _AC_LINK_IFELSE is expanded from...
../../lib/autoconf/general.m4:2679: AC_LINK_IFELSE is expanded from...
build/aclocal.cairo.m4:89: CAIRO_CC_TRY_LINK_WITH_ENV_SILENT is expanded from...
build/configure.ac.pthread:136: CAIRO_CHECK_PTHREAD is expanded from...
build/configure.ac.pthread:189: CAIRO_CONFIGURE_PTHREAD is expanded from...
../../lib/m4sugar/m4sh.m4:606: AS_IF is expanded from...
../../lib/autoconf/general.m4:2032: AC_CACHE_VAL is expanded from...
../../lib/autoconf/general.m4:2053: AC_CACHE_CHECK is expanded from...
../../lib/m4sugar/m4sh.m4:517: AS_CASE is expanded from...
build/aclocal.enable.m4:41: _CAIRO_ENABLE is expanded from...
build/configure.ac.features:23: CAIRO_ENABLE is expanded from...
configure.ac:646: the top level
build/configure.ac.warnings:39: warning: AC_LANG_CONFTEST: no AC_LANG_SOURCE call detected in body
../../lib/autoconf/lang.m4:194: AC_LANG_CONFTEST is expanded from...
../../lib/autoconf/general.m4:2662: _AC_LINK_IFELSE is expanded from...
../../lib/autoconf/general.m4:2679: AC_LINK_IFELSE is expanded from...
build/aclocal.cairo.m4:89: CAIRO_CC_TRY_LINK_WITH_ENV_SILENT is expanded from...
build/aclocal.cairo.m4:124: CAIRO_CC_TRY_FLAG_SILENT is expanded from...
build/aclocal.cairo.m4:131: CAIRO_CC_CHECK_WERROR is expanded from...
build/aclocal.cairo.m4:148: CAIRO_CC_TRY_FLAG is expanded from...
../../lib/m4sugar/m4sh.m4:606: AS_IF is expanded from...
../../lib/autoconf/general.m4:2032: AC_CACHE_VAL is expanded from...
../../lib/autoconf/general.m4:2053: AC_CACHE_CHECK is expanded from...
build/configure.ac.warnings:39: the top level
build/configure.ac.warnings:39: warning: AC_LANG_CONFTEST: no AC_LANG_SOURCE call detected in body
../../lib/autoconf/lang.m4:194: AC_LANG_CONFTEST is expanded from...
../../lib/autoconf/general.m4:2662: _AC_LINK_IFELSE is expanded from...
../../lib/autoconf/general.m4:2679: AC_LINK_IFELSE is expanded from...
build/aclocal.cairo.m4:89: CAIRO_CC_TRY_LINK_WITH_ENV_SILENT is expanded from...
build/aclocal.cairo.m4:124: CAIRO_CC_TRY_FLAG_SILENT is expanded from...
build/aclocal.cairo.m4:148: CAIRO_CC_TRY_FLAG is expanded from...
../../lib/m4sugar/m4sh.m4:606: AS_IF is expanded from...
../../lib/autoconf/general.m4:2032: AC_CACHE_VAL is expanded from...
../../lib/autoconf/general.m4:2053: AC_CACHE_CHECK is expanded from...
build/configure.ac.warnings:39: the top level
build/configure.ac.warnings:69: warning: AC_LANG_CONFTEST: no AC_LANG_SOURCE call detected in body
../../lib/autoconf/lang.m4:194: AC_LANG_CONFTEST is expanded from...
../../lib/autoconf/general.m4:2662: _AC_LINK_IFELSE is expanded from...
../../lib/autoconf/general.m4:2679: AC_LINK_IFELSE is expanded from...
build/aclocal.cairo.m4:89: CAIRO_CC_TRY_LINK_WITH_ENV_SILENT is expanded from...
build/aclocal.cairo.m4:124: CAIRO_CC_TRY_FLAG_SILENT is expanded from...
../../lib/m4sugar/m4sh.m4:606: AS_IF is expanded from...
../../lib/autoconf/general.m4:2032: AC_CACHE_VAL is expanded from...
../../lib/autoconf/general.m4:2053: AC_CACHE_CHECK is expanded from...
build/configure.ac.warnings:69: the top level
build/configure.ac.warnings:83: warning: AC_LANG_CONFTEST: no AC_LANG_SOURCE call detected in body
../../lib/autoconf/lang.m4:194: AC_LANG_CONFTEST is expanded from...
../../lib/autoconf/general.m4:2662: _AC_LINK_IFELSE is expanded from...
../../lib/autoconf/general.m4:2679: AC_LINK_IFELSE is expanded from...
build/aclocal.cairo.m4:89: CAIRO_CC_TRY_LINK_WITH_ENV_SILENT is expanded from...
build/aclocal.cairo.m4:124: CAIRO_CC_TRY_FLAG_SILENT is expanded from...
build/aclocal.cairo.m4:131: CAIRO_CC_CHECK_WERROR is expanded from...
build/aclocal.cairo.m4:148: CAIRO_CC_TRY_FLAG is expanded from...
../../lib/m4sugar/m4sh.m4:606: AS_IF is expanded from...
../../lib/autoconf/general.m4:2032: AC_CACHE_VAL is expanded from...
../../lib/autoconf/general.m4:2053: AC_CACHE_CHECK is expanded from...
build/configure.ac.warnings:83: the top level
build/configure.ac.warnings:83: warning: AC_LANG_CONFTEST: no AC_LANG_SOURCE call detected in body
../../lib/autoconf/lang.m4:194: AC_LANG_CONFTEST is expanded from...
../../lib/autoconf/general.m4:2662: _AC_LINK_IFELSE is expanded from...
../../lib/autoconf/general.m4:2679: AC_LINK_IFELSE is expanded from...
build/aclocal.cairo.m4:89: CAIRO_CC_TRY_LINK_WITH_ENV_SILENT is expanded from...
build/aclocal.cairo.m4:124: CAIRO_CC_TRY_FLAG_SILENT is expanded from...
build/aclocal.cairo.m4:148: CAIRO_CC_TRY_FLAG is expanded from...
../../lib/m4sugar/m4sh.m4:606: AS_IF is expanded from...
../../lib/autoconf/general.m4:2032: AC_CACHE_VAL is expanded from...
../../lib/autoconf/general.m4:2053: AC_CACHE_CHECK is expanded from...
build/configure.ac.warnings:83: the top level
build/configure.ac.analysis:75: warning: AC_LANG_CONFTEST: no AC_LANG_SOURCE call detected in body
../../lib/autoconf/lang.m4:194: AC_LANG_CONFTEST is expanded from...
../../lib/autoconf/general.m4:2662: _AC_LINK_IFELSE is expanded from...
../../lib/autoconf/general.m4:2679: AC_LINK_IFELSE is expanded from...
build/aclocal.cairo.m4:89: CAIRO_CC_TRY_LINK_WITH_ENV_SILENT is expanded from...
build/aclocal.cairo.m4:124: CAIRO_CC_TRY_FLAG_SILENT is expanded from...
build/aclocal.cairo.m4:131: CAIRO_CC_CHECK_WERROR is expanded from...
build/aclocal.cairo.m4:148: CAIRO_CC_TRY_FLAG is expanded from...
build/configure.ac.analysis:75: the top level
build/configure.ac.analysis:75: warning: AC_LANG_CONFTEST: no AC_LANG_SOURCE call detected in body
../../lib/autoconf/lang.m4:194: AC_LANG_CONFTEST is expanded from...
../../lib/autoconf/general.m4:2662: _AC_LINK_IFELSE is expanded from...
../../lib/autoconf/general.m4:2679: AC_LINK_IFELSE is expanded from...
build/aclocal.cairo.m4:89: CAIRO_CC_TRY_LINK_WITH_ENV_SILENT is expanded from...
build/aclocal.cairo.m4:124: CAIRO_CC_TRY_FLAG_SILENT is expanded from...
build/aclocal.cairo.m4:148: CAIRO_CC_TRY_FLAG is expanded from...
build/configure.ac.analysis:75: the top level
configure.ac:646: warning: AC_LANG_CONFTEST: no AC_LANG_SOURCE call detected in body
../../lib/autoconf/lang.m4:194: AC_LANG_CONFTEST is expanded from...
../../lib/autoconf/general.m4:2662: _AC_LINK_IFELSE is expanded from...
../../lib/autoconf/general.m4:2679: AC_LINK_IFELSE is expanded from...
build/aclocal.cairo.m4:89: CAIRO_CC_TRY_LINK_WITH_ENV_SILENT is expanded from...
build/configure.ac.pthread:136: CAIRO_CHECK_PTHREAD is expanded from...
build/configure.ac.pthread:189: CAIRO_CONFIGURE_PTHREAD is expanded from...
../../lib/m4sugar/m4sh.m4:606: AS_IF is expanded from...
../../lib/autoconf/general.m4:2032: AC_CACHE_VAL is expanded from...
../../lib/autoconf/general.m4:2053: AC_CACHE_CHECK is expanded from...
../../lib/m4sugar/m4sh.m4:517: AS_CASE is expanded from...
build/aclocal.enable.m4:41: _CAIRO_ENABLE is expanded from...
build/configure.ac.features:23: CAIRO_ENABLE is expanded from...
configure.ac:646: the top level
build/configure.ac.warnings:39: warning: AC_LANG_CONFTEST: no AC_LANG_SOURCE call detected in body
../../lib/autoconf/lang.m4:194: AC_LANG_CONFTEST is expanded from...
../../lib/autoconf/general.m4:2662: _AC_LINK_IFELSE is expanded from...
../../lib/autoconf/general.m4:2679: AC_LINK_IFELSE is expanded from...
build/aclocal.cairo.m4:89: CAIRO_CC_TRY_LINK_WITH_ENV_SILENT is expanded from...
build/aclocal.cairo.m4:124: CAIRO_CC_TRY_FLAG_SILENT is expanded from...
build/aclocal.cairo.m4:131: CAIRO_CC_CHECK_WERROR is expanded from...
build/aclocal.cairo.m4:148: CAIRO_CC_TRY_FLAG is expanded from...
../../lib/m4sugar/m4sh.m4:606: AS_IF is expanded from...
../../lib/autoconf/general.m4:2032: AC_CACHE_VAL is expanded from...
../../lib/autoconf/general.m4:2053: AC_CACHE_CHECK is expanded from...
build/configure.ac.warnings:39: the top level
build/configure.ac.warnings:39: warning: AC_LANG_CONFTEST: no AC_LANG_SOURCE call detected in body
../../lib/autoconf/lang.m4:194: AC_LANG_CONFTEST is expanded from...
../../lib/autoconf/general.m4:2662: _AC_LINK_IFELSE is expanded from...
../../lib/autoconf/general.m4:2679: AC_LINK_IFELSE is expanded from...
build/aclocal.cairo.m4:89: CAIRO_CC_TRY_LINK_WITH_ENV_SILENT is expanded from...
build/aclocal.cairo.m4:124: CAIRO_CC_TRY_FLAG_SILENT is expanded from...
build/aclocal.cairo.m4:148: CAIRO_CC_TRY_FLAG is expanded from...
../../lib/m4sugar/m4sh.m4:606: AS_IF is expanded from...
../../lib/autoconf/general.m4:2032: AC_CACHE_VAL is expanded from...
../../lib/autoconf/general.m4:2053: AC_CACHE_CHECK is expanded from...
build/configure.ac.warnings:39: the top level
build/configure.ac.warnings:69: warning: AC_LANG_CONFTEST: no AC_LANG_SOURCE call detected in body
../../lib/autoconf/lang.m4:194: AC_LANG_CONFTEST is expanded from...
../../lib/autoconf/general.m4:2662: _AC_LINK_IFELSE is expanded from...
../../lib/autoconf/general.m4:2679: AC_LINK_IFELSE is expanded from...
build/aclocal.cairo.m4:89: CAIRO_CC_TRY_LINK_WITH_ENV_SILENT is expanded from...
build/aclocal.cairo.m4:124: CAIRO_CC_TRY_FLAG_SILENT is expanded from...
../../lib/m4sugar/m4sh.m4:606: AS_IF is expanded from...
../../lib/autoconf/general.m4:2032: AC_CACHE_VAL is expanded from...
../../lib/autoconf/general.m4:2053: AC_CACHE_CHECK is expanded from...
build/configure.ac.warnings:69: the top level
build/configure.ac.warnings:83: warning: AC_LANG_CONFTEST: no AC_LANG_SOURCE call detected in body
../../lib/autoconf/lang.m4:194: AC_LANG_CONFTEST is expanded from...
../../lib/autoconf/general.m4:2662: _AC_LINK_IFELSE is expanded from...
../../lib/autoconf/general.m4:2679: AC_LINK_IFELSE is expanded from...
build/aclocal.cairo.m4:89: CAIRO_CC_TRY_LINK_WITH_ENV_SILENT is expanded from...
build/aclocal.cairo.m4:124: CAIRO_CC_TRY_FLAG_SILENT is expanded from...
build/aclocal.cairo.m4:131: CAIRO_CC_CHECK_WERROR is expanded from...
build/aclocal.cairo.m4:148: CAIRO_CC_TRY_FLAG is expanded from...
../../lib/m4sugar/m4sh.m4:606: AS_IF is expanded from...
../../lib/autoconf/general.m4:2032: AC_CACHE_VAL is expanded from...
../../lib/autoconf/general.m4:2053: AC_CACHE_CHECK is expanded from...
build/configure.ac.warnings:83: the top level
build/configure.ac.warnings:83: warning: AC_LANG_CONFTEST: no AC_LANG_SOURCE call detected in body
../../lib/autoconf/lang.m4:194: AC_LANG_CONFTEST is expanded from...
../../lib/autoconf/general.m4:2662: _AC_LINK_IFELSE is expanded from...
../../lib/autoconf/general.m4:2679: AC_LINK_IFELSE is expanded from...
build/aclocal.cairo.m4:89: CAIRO_CC_TRY_LINK_WITH_ENV_SILENT is expanded from...
build/aclocal.cairo.m4:124: CAIRO_CC_TRY_FLAG_SILENT is expanded from...
build/aclocal.cairo.m4:148: CAIRO_CC_TRY_FLAG is expanded from...
../../lib/m4sugar/m4sh.m4:606: AS_IF is expanded from...
../../lib/autoconf/general.m4:2032: AC_CACHE_VAL is expanded from...
../../lib/autoconf/general.m4:2053: AC_CACHE_CHECK is expanded from...
build/configure.ac.warnings:83: the top level
build/configure.ac.analysis:75: warning: AC_LANG_CONFTEST: no AC_LANG_SOURCE call detected in body
../../lib/autoconf/lang.m4:194: AC_LANG_CONFTEST is expanded from...
../../lib/autoconf/general.m4:2662: _AC_LINK_IFELSE is expanded from...
../../lib/autoconf/general.m4:2679: AC_LINK_IFELSE is expanded from...
build/aclocal.cairo.m4:89: CAIRO_CC_TRY_LINK_WITH_ENV_SILENT is expanded from...
build/aclocal.cairo.m4:124: CAIRO_CC_TRY_FLAG_SILENT is expanded from...
build/aclocal.cairo.m4:131: CAIRO_CC_CHECK_WERROR is expanded from...
build/aclocal.cairo.m4:148: CAIRO_CC_TRY_FLAG is expanded from...
build/configure.ac.analysis:75: the top level
build/configure.ac.analysis:75: warning: AC_LANG_CONFTEST: no AC_LANG_SOURCE call detected in body
../../lib/autoconf/lang.m4:194: AC_LANG_CONFTEST is expanded from...
../../lib/autoconf/general.m4:2662: _AC_LINK_IFELSE is expanded from...
../../lib/autoconf/general.m4:2679: AC_LINK_IFELSE is expanded from...
build/aclocal.cairo.m4:89: CAIRO_CC_TRY_LINK_WITH_ENV_SILENT is expanded from...
build/aclocal.cairo.m4:124: CAIRO_CC_TRY_FLAG_SILENT is expanded from...
build/aclocal.cairo.m4:148: CAIRO_CC_TRY_FLAG is expanded from...
build/configure.ac.analysis:75: the top level
configure.ac:646: warning: AC_LANG_CONFTEST: no AC_LANG_SOURCE call detected in body
../../lib/autoconf/lang.m4:194: AC_LANG_CONFTEST is expanded from...
../../lib/autoconf/general.m4:2662: _AC_LINK_IFELSE is expanded from...
../../lib/autoconf/general.m4:2679: AC_LINK_IFELSE is expanded from...
build/aclocal.cairo.m4:89: CAIRO_CC_TRY_LINK_WITH_ENV_SILENT is expanded from...
build/configure.ac.pthread:136: CAIRO_CHECK_PTHREAD is expanded from...
build/configure.ac.pthread:189: CAIRO_CONFIGURE_PTHREAD is expanded from...
../../lib/m4sugar/m4sh.m4:606: AS_IF is expanded from...
../../lib/autoconf/general.m4:2032: AC_CACHE_VAL is expanded from...
../../lib/autoconf/general.m4:2053: AC_CACHE_CHECK is expanded from...
../../lib/m4sugar/m4sh.m4:517: AS_CASE is expanded from...
build/aclocal.enable.m4:41: _CAIRO_ENABLE is expanded from...
build/configure.ac.features:23: CAIRO_ENABLE is expanded from...
configure.ac:646: the top level
build/configure.ac.warnings:39: warning: AC_LANG_CONFTEST: no AC_LANG_SOURCE call detected in body
../../lib/autoconf/lang.m4:194: AC_LANG_CONFTEST is expanded from...
../../lib/autoconf/general.m4:2662: _AC_LINK_IFELSE is expanded from...
../../lib/autoconf/general.m4:2679: AC_LINK_IFELSE is expanded from...
build/aclocal.cairo.m4:89: CAIRO_CC_TRY_LINK_WITH_ENV_SILENT is expanded from...
build/aclocal.cairo.m4:124: CAIRO_CC_TRY_FLAG_SILENT is expanded from...
build/aclocal.cairo.m4:131: CAIRO_CC_CHECK_WERROR is expanded from...
build/aclocal.cairo.m4:148: CAIRO_CC_TRY_FLAG is expanded from...
../../lib/m4sugar/m4sh.m4:606: AS_IF is expanded from...
../../lib/autoconf/general.m4:2032: AC_CACHE_VAL is expanded from...
../../lib/autoconf/general.m4:2053: AC_CACHE_CHECK is expanded from...
build/configure.ac.warnings:39: the top level
build/configure.ac.warnings:39: warning: AC_LANG_CONFTEST: no AC_LANG_SOURCE call detected in body
../../lib/autoconf/lang.m4:194: AC_LANG_CONFTEST is expanded from...
../../lib/autoconf/general.m4:2662: _AC_LINK_IFELSE is expanded from...
../../lib/autoconf/general.m4:2679: AC_LINK_IFELSE is expanded from...
build/aclocal.cairo.m4:89: CAIRO_CC_TRY_LINK_WITH_ENV_SILENT is expanded from...
build/aclocal.cairo.m4:124: CAIRO_CC_TRY_FLAG_SILENT is expanded from...
build/aclocal.cairo.m4:148: CAIRO_CC_TRY_FLAG is expanded from...
../../lib/m4sugar/m4sh.m4:606: AS_IF is expanded from...
../../lib/autoconf/general.m4:2032: AC_CACHE_VAL is expanded from...
../../lib/autoconf/general.m4:2053: AC_CACHE_CHECK is expanded from...
build/configure.ac.warnings:39: the top level
build/configure.ac.warnings:69: warning: AC_LANG_CONFTEST: no AC_LANG_SOURCE call detected in body
../../lib/autoconf/lang.m4:194: AC_LANG_CONFTEST is expanded from...
../../lib/autoconf/general.m4:2662: _AC_LINK_IFELSE is expanded from...
../../lib/autoconf/general.m4:2679: AC_LINK_IFELSE is expanded from...
build/aclocal.cairo.m4:89: CAIRO_CC_TRY_LINK_WITH_ENV_SILENT is expanded from...
build/aclocal.cairo.m4:124: CAIRO_CC_TRY_FLAG_SILENT is expanded from...
../../lib/m4sugar/m4sh.m4:606: AS_IF is expanded from...
../../lib/autoconf/general.m4:2032: AC_CACHE_VAL is expanded from...
../../lib/autoconf/general.m4:2053: AC_CACHE_CHECK is expanded from...
build/configure.ac.warnings:69: the top level
build/configure.ac.warnings:83: warning: AC_LANG_CONFTEST: no AC_LANG_SOURCE call detected in body
../../lib/autoconf/lang.m4:194: AC_LANG_CONFTEST is expanded from...
../../lib/autoconf/general.m4:2662: _AC_LINK_IFELSE is expanded from...
../../lib/autoconf/general.m4:2679: AC_LINK_IFELSE is expanded from...
build/aclocal.cairo.m4:89: CAIRO_CC_TRY_LINK_WITH_ENV_SILENT is expanded from...
build/aclocal.cairo.m4:124: CAIRO_CC_TRY_FLAG_SILENT is expanded from...
build/aclocal.cairo.m4:131: CAIRO_CC_CHECK_WERROR is expanded from...
build/aclocal.cairo.m4:148: CAIRO_CC_TRY_FLAG is expanded from...
../../lib/m4sugar/m4sh.m4:606: AS_IF is expanded from...
../../lib/autoconf/general.m4:2032: AC_CACHE_VAL is expanded from...
../../lib/autoconf/general.m4:2053: AC_CACHE_CHECK is expanded from...
build/configure.ac.warnings:83: the top level
build/configure.ac.warnings:83: warning: AC_LANG_CONFTEST: no AC_LANG_SOURCE call detected in body
../../lib/autoconf/lang.m4:194: AC_LANG_CONFTEST is expanded from...
../../lib/autoconf/general.m4:2662: _AC_LINK_IFELSE is expanded from...
../../lib/autoconf/general.m4:2679: AC_LINK_IFELSE is expanded from...
build/aclocal.cairo.m4:89: CAIRO_CC_TRY_LINK_WITH_ENV_SILENT is expanded from...
build/aclocal.cairo.m4:124: CAIRO_CC_TRY_FLAG_SILENT is expanded from...
build/aclocal.cairo.m4:148: CAIRO_CC_TRY_FLAG is expanded from...
../../lib/m4sugar/m4sh.m4:606: AS_IF is expanded from...
../../lib/autoconf/general.m4:2032: AC_CACHE_VAL is expanded from...
../../lib/autoconf/general.m4:2053: AC_CACHE_CHECK is expanded from...
build/configure.ac.warnings:83: the top level
build/configure.ac.analysis:75: warning: AC_LANG_CONFTEST: no AC_LANG_SOURCE call detected in body
../../lib/autoconf/lang.m4:194: AC_LANG_CONFTEST is expanded from...
../../lib/autoconf/general.m4:2662: _AC_LINK_IFELSE is expanded from...
../../lib/autoconf/general.m4:2679: AC_LINK_IFELSE is expanded from...
build/aclocal.cairo.m4:89: CAIRO_CC_TRY_LINK_WITH_ENV_SILENT is expanded from...
build/aclocal.cairo.m4:124: CAIRO_CC_TRY_FLAG_SILENT is expanded from...
build/aclocal.cairo.m4:131: CAIRO_CC_CHECK_WERROR is expanded from...
build/aclocal.cairo.m4:148: CAIRO_CC_TRY_FLAG is expanded from...
build/configure.ac.analysis:75: the top level
build/configure.ac.analysis:75: warning: AC_LANG_CONFTEST: no AC_LANG_SOURCE call detected in body
../../lib/autoconf/lang.m4:194: AC_LANG_CONFTEST is expanded from...
../../lib/autoconf/general.m4:2662: _AC_LINK_IFELSE is expanded from...
../../lib/autoconf/general.m4:2679: AC_LINK_IFELSE is expanded from...
build/aclocal.cairo.m4:89: CAIRO_CC_TRY_LINK_WITH_ENV_SILENT is expanded from...
build/aclocal.cairo.m4:124: CAIRO_CC_TRY_FLAG_SILENT is expanded from...
build/aclocal.cairo.m4:148: CAIRO_CC_TRY_FLAG is expanded from...
build/configure.ac.analysis:75: the top level
configure.ac:646: warning: AC_LANG_CONFTEST: no AC_LANG_SOURCE call detected in body
../../lib/autoconf/lang.m4:194: AC_LANG_CONFTEST is expanded from...
../../lib/autoconf/general.m4:2662: _AC_LINK_IFELSE is expanded from...
../../lib/autoconf/general.m4:2679: AC_LINK_IFELSE is expanded from...
build/aclocal.cairo.m4:89: CAIRO_CC_TRY_LINK_WITH_ENV_SILENT is expanded from...
build/configure.ac.pthread:136: CAIRO_CHECK_PTHREAD is expanded from...
build/configure.ac.pthread:189: CAIRO_CONFIGURE_PTHREAD is expanded from...
../../lib/m4sugar/m4sh.m4:606: AS_IF is expanded from...
../../lib/autoconf/general.m4:2032: AC_CACHE_VAL is expanded from...
../../lib/autoconf/general.m4:2053: AC_CACHE_CHECK is expanded from...
../../lib/m4sugar/m4sh.m4:517: AS_CASE is expanded from...
build/aclocal.enable.m4:41: _CAIRO_ENABLE is expanded from...
build/configure.ac.features:23: CAIRO_ENABLE is expanded from...
configure.ac:646: the top level
test/Makefile.am:1735: `%'-style pattern rules are a GNU make extension
test/Makefile.am:1736: <: non-POSIX variable name
build/Makefile.am.changelog:57: `%'-style pattern rules are a GNU make extension
Makefile.am:80:   `build/Makefile.am.changelog' included from here
patch -Np1 < debian/ltmain_as-needed.patch
patching file build/ltmain.sh
Hunk #1 succeeded at 5800 (offset 1084 lines).
Hunk #2 FAILED at 5075.
1 out of 2 hunks FAILED -- saving rejects to file build/ltmain.sh.rej
make: *** [configure-common-stamp] Ошибка 1
dpkg-buildpackage: error: debian/rules build gave error exit status 2

Часть лога:
patch -Np1 < debian/ltmain_as-needed.patch
patching file build/ltmain.sh
Hunk #1 succeeded at 5800 (offset 1084 lines).
Hunk #2 FAILED at 5075.
1 out of 2 hunks FAILED -- saving rejects to file build/ltmain.sh.rej
make: *** [configure-common-stamp] Ошибка 1
dpkg-buildpackage: error: debian/rules build gave error exit status 2
Система: Debian Sid
 

Оффлайн Squeezer

  • Topic Author
  • Сообщений: 51
Re: Проблемы со сборкой libcairo.
« Ответ #1 : 04 Декабрь 2011, 19:57:25 »
paulcarroty, я так понимаю это патчи расположенные в папке с сырцами. Там папка debian  и в ней есть каталог patches и ltmain_as-needed.patch.
Содержание patches:
$ls patches/
01_build_perf_utils.patch    03_export-symbols.patch                   05-flto.patch
02_am-maintainer-mode.patch  04-LD_PRELOAD-is-supported-on-Hurd.patch  series
А изначально хотел наложить патч cairo-9999-cleartype.patch.
 

Оффлайн Squeezer

  • Topic Author
  • Сообщений: 51
Re: Проблемы со сборкой libcairo.
« Ответ #2 : 04 Декабрь 2011, 20:38:23 »
Тоесть это оригинальный патч?
Если вы имеете ввиду cairo-9999-cleartype.patch, то нет. Все остальные - да.
Предыстория:
Сначала решил собрать пакет с патчем cairo-9999-cleartype.patch, но все мой действия по сборке заканчивались ошибками. В желании разобраться в чем проблема решил собрать без наложения этого патча, но как видите тоже все безрезультатно.
 

Теги: