Ошибка при установке драйвера wi-fi

Автор kex, 24 декабря 2015, 17:21:35

« назад - далее »

0 Пользователи и 1 гость просматривают эту тему.

kex

Приветствую всех.Возникла проблема при установке драйвера rt 3070

  • root@alex:~/Рабочий стол/2011_0719_RT3070_RT3370_RT5370_RT5372_Linux_STA_V2.5.0.3_DPO# make
    make -C tools
    make[1]: вход в каталог «/root/Рабочий стол/2011_0719_RT3070_RT3370_RT5370_RT5372_Linux_STA_V2.5.0.3_DPO/tools»
    gcc -g bin2h.c -o bin2h
    make[1]: выход из каталога «/root/Рабочий стол/2011_0719_RT3070_RT3370_RT5370_RT5372_Linux_STA_V2.5.0.3_DPO/tools»
    /root/Рабочий стол/2011_0719_RT3070_RT3370_RT5370_RT5372_Linux_STA_V2.5.0.3_DPO/tools/bin2h
    make: /root/Рабочий: Команда не найдена
    Makefile:292: ошибка выполнения рецепта для цели «build_tools»
    make: *** [build_tools] Ошибка 127

ferum

 На рабочем столе root ни чего не делает. Что творим и по какому мануалу?
Русские дебианщики против цифрового слабоумия !

kex

#2
ferum, Извиняюсь за долгий ответ ,у нас разные часовые пояса , вот ман
[url="http://askubuntu.com/questions/148767/help-do-i-install-the-ralink-rt3070-wireless-driver"]http://askubuntu.com/questions/148767/help-do-i-install-the-ralink-rt3070-wireless-driver[/url]
Ну и по вашей ссылочке тоже.
[url="https://debianforum.ru/go.php?url=https://forums.kali.org/showthread.php?23227-How-install-Alfa-AWUS036H-wireless-driver-in-kali-linux-rt3070-chipset"]https://debianforum.ru/go.php?url=https://forums.kali.org/showthread.php?23227-How-install-Alfa-AWUS036H-wireless-driver-in-kali-linux-rt3070-chipset[/url]

Cообщение объединено 25 декабря 2015, 02:06:44

ferum, Всеравно получаю ошибку
[list type=decimal]
[li][color=red]root@alex[/color]:[color=blue]~/Загрузки/2011_0719_RT3070_RT3370_RT5370_RT5372_Linux_STA_V2.5.0.3_DPO[/color]# make
make -C tools
make[1]: вход в каталог «/root/Загрузки/2011_0719_RT3070_RT3370_RT5370_RT5372_Linux_STA_V2.5.0.3_DPO/tools»
gcc -g bin2h.c -o bin2h
make[1]: выход из каталога «/root/Загрузки/2011_0719_RT3070_RT3370_RT5370_RT5372_Linux_STA_V2.5.0.3_DPO/tools»
/root/Загрузки/2011_0719_RT3070_RT3370_RT5370_RT5372_Linux_STA_V2.5.0.3_DPO/tools/bin2h
cp -f os/linux/Makefile.6 /root/Загрузки/2011_0719_RT3070_RT3370_RT5370_RT5372_Linux_STA_V2.5.0.3_DPO/os/linux/Makefile
make -C /lib/modules/4.0.0-kali1-amd64/build SUBDIRS=/root/Загрузки/2011_0719_RT3070_RT3370_RT5370_RT5372_Linux_STA_V2.5.0.3_DPO/os/linux modules
make[1]: вход в каталог «/usr/src/linux-headers-4.0.0-kali1-amd64»
Makefile:10: *** mixed implicit and normal rules: deprecated syntax
  CC [M]  /root/Загрузки/2011_0719_RT3070_RT3370_RT5370_RT5372_Linux_STA_V2.5.0.3_DPO/os/linux/../../common/crypt_md5.o
In file included from /root/Загрузки/2011_0719_RT3070_RT3370_RT5370_RT5372_Linux_STA_V2.5.0.3_DPO/include/rtmp_os.h:44:0,
                 from /root/Загрузки/2011_0719_RT3070_RT3370_RT5370_RT5372_Linux_STA_V2.5.0.3_DPO/include/rtmp_comm.h:60,
                 from /root/Загрузки/2011_0719_RT3070_RT3370_RT5370_RT5372_Linux_STA_V2.5.0.3_DPO/include/rt_config.h:33,
                 from /root/Загрузки/2011_0719_RT3070_RT3370_RT5370_RT5372_Linux_STA_V2.5.0.3_DPO/os/linux/../../common/crypt_md5.c:28:
/root/Загрузки/2011_0719_RT3070_RT3370_RT5370_RT5372_Linux_STA_V2.5.0.3_DPO/os/linux/../../common/crypt_md5.c: In function 'MD5Final':
/root/Загрузки/2011_0719_RT3070_RT3370_RT5370_RT5372_Linux_STA_V2.5.0.3_DPO/os/linux/../../common/crypt_md5.c:333:32: warning: argument to 'sizeof' in 'memset' call is the same expression as the destination; did you mean to dereference it? [-Wsizeof-pointer-memaccess]
     NdisZeroMemory(pCtx, sizeof(pCtx)); /* memory free */
                                ^
/root/Загрузки/2011_0719_RT3070_RT3370_RT5370_RT5372_Linux_STA_V2.5.0.3_DPO/include/os/rt_linux.h:469:76: note: in definition of macro 'NdisZeroMemory'
#define NdisZeroMemory(Destination, Length)         memset(Destination, 0, Length)
                                                                            ^
/root/Загрузки/2011_0719_RT3070_RT3370_RT5370_RT5372_Linux_STA_V2.5.0.3_DPO/os/linux/../../common/crypt_md5.c: In function 'SHAFinal':
/root/Загрузки/2011_0719_RT3070_RT3370_RT5370_RT5372_Linux_STA_V2.5.0.3_DPO/os/linux/../../common/crypt_md5.c:632:32: warning: argument to 'sizeof' in 'memset' call is the same expression as the destination; did you mean to dereference it? [-Wsizeof-pointer-memaccess]
     NdisZeroMemory(pCtx, sizeof(pCtx)); /* memory free */
                                ^
/root/Загрузки/2011_0719_RT3070_RT3370_RT5370_RT5372_Linux_STA_V2.5.0.3_DPO/include/os/rt_linux.h:469:76: note: in definition of macro 'NdisZeroMemory'
#define NdisZeroMemory(Destination, Length)         memset(Destination, 0, Length)
                                                                            ^
  CC [M]  /root/Загрузки/2011_0719_RT3070_RT3370_RT5370_RT5372_Linux_STA_V2.5.0.3_DPO/os/linux/../../common/crypt_sha2.o
  CC [M]  /root/Загрузки/2011_0719_RT3070_RT3370_RT5370_RT5372_Linux_STA_V2.5.0.3_DPO/os/linux/../../common/crypt_hmac.o
  CC [M]  /root/Загрузки/2011_0719_RT3070_RT3370_RT5370_RT5372_Linux_STA_V2.5.0.3_DPO/os/linux/../../common/crypt_aes.o
  CC [M]  /root/Загрузки/2011_0719_RT3070_RT3370_RT5370_RT5372_Linux_STA_V2.5.0.3_DPO/os/linux/../../common/crypt_arc4.o
  CC [M]  /root/Загрузки/2011_0719_RT3070_RT3370_RT5370_RT5372_Linux_STA_V2.5.0.3_DPO/os/linux/../../common/mlme.o
In file included from /root/Загрузки/2011_0719_RT3070_RT3370_RT5370_RT5372_Linux_STA_V2.5.0.3_DPO/include/rtmp_os.h:44:0,
                 from /root/Загрузки/2011_0719_RT3070_RT3370_RT5370_RT5372_Linux_STA_V2.5.0.3_DPO/include/rtmp_comm.h:60,
                 from /root/Загрузки/2011_0719_RT3070_RT3370_RT5370_RT5372_Linux_STA_V2.5.0.3_DPO/include/rt_config.h:33,
                 from /root/Загрузки/2011_0719_RT3070_RT3370_RT5370_RT5372_Linux_STA_V2.5.0.3_DPO/os/linux/../../common/mlme.c:28:
/root/Загрузки/2011_0719_RT3070_RT3370_RT5370_RT5372_Linux_STA_V2.5.0.3_DPO/os/linux/../../common/mlme.c: In function 'MlmeResetRalinkCounters':
/root/Загрузки/2011_0719_RT3070_RT3370_RT5370_RT5372_Linux_STA_V2.5.0.3_DPO/os/linux/../../common/mlme.c:1086:7: warning: cast from pointer to integer of different size [-Wpointer-to-int-cast]
       (UINT32)&pAd->RalinkCounters.OneSecEnd -
       ^
/root/Загрузки/2011_0719_RT3070_RT3370_RT5370_RT5372_Linux_STA_V2.5.0.3_DPO/include/os/rt_linux.h:469:76: note: in definition of macro 'NdisZeroMemory'
#define NdisZeroMemory(Destination, Length)         memset(Destination, 0, Length)
                                                                            ^
/root/Загрузки/2011_0719_RT3070_RT3370_RT5370_RT5372_Linux_STA_V2.5.0.3_DPO/os/linux/../../common/mlme.c:1087:7: warning: cast from pointer to integer of different size [-Wpointer-to-int-cast]
       (UINT32)&pAd->RalinkCounters.OneSecStart);
       ^
/root/Загрузки/2011_0719_RT3070_RT3370_RT5370_RT5372_Linux_STA_V2.5.0.3_DPO/include/os/rt_linux.h:469:76: note: in definition of macro 'NdisZeroMemory'
#define NdisZeroMemory(Destination, Length)         memset(Destination, 0, Length)
                                                                            ^
/root/Загрузки/2011_0719_RT3070_RT3370_RT5370_RT5372_Linux_STA_V2.5.0.3_DPO/os/linux/../../common/mlme.c: In function 'MlmePeriodicExec':
/root/Загрузки/2011_0719_RT3070_RT3370_RT5370_RT5372_Linux_STA_V2.5.0.3_DPO/os/linux/../../common/mlme.c:1248:8: warning: cast from pointer to integer of different size [-Wpointer-to-int-cast]
        (UINT32)&pAd->RalinkCounters.OneSecEnd -
        ^
/root/Загрузки/2011_0719_RT3070_RT3370_RT5370_RT5372_Linux_STA_V2.5.0.3_DPO/include/os/rt_linux.h:469:76: note: in definition of macro 'NdisZeroMemory'
#define NdisZeroMemory(Destination, Length)         memset(Destination, 0, Length)
                                                                            ^
/root/Загрузки/2011_0719_RT3070_RT3370_RT5370_RT5372_Linux_STA_V2.5.0.3_DPO/os/linux/../../common/mlme.c:1249:8: warning: cast from pointer to integer of different size [-Wpointer-to-int-cast]
        (UINT32)&pAd->RalinkCounters.OneSecStart);
        ^
/root/Загрузки/2011_0719_RT3070_RT3370_RT5370_RT5372_Linux_STA_V2.5.0.3_DPO/include/os/rt_linux.h:469:76: note: in definition of macro 'NdisZeroMemory'
#define NdisZeroMemory(Destination, Length)         memset(Destination, 0, Length)
                                                                            ^
  CC [M]  /root/Загрузки/2011_0719_RT3070_RT3370_RT5370_RT5372_Linux_STA_V2.5.0.3_DPO/os/linux/../../common/cmm_wep.o
  CC [M]  /root/Загрузки/2011_0719_RT3070_RT3370_RT5370_RT5372_Linux_STA_V2.5.0.3_DPO/os/linux/../../common/action.o
  CC [M]  /root/Загрузки/2011_0719_RT3070_RT3370_RT5370_RT5372_Linux_STA_V2.5.0.3_DPO/os/linux/../../common/cmm_data.o
  CC [M]  /root/Загрузки/2011_0719_RT3070_RT3370_RT5370_RT5372_Linux_STA_V2.5.0.3_DPO/os/linux/../../common/rtmp_init.o
  CC [M]  /root/Загрузки/2011_0719_RT3070_RT3370_RT5370_RT5372_Linux_STA_V2.5.0.3_DPO/os/linux/../../common/rtmp_init_inf.o
  CC [M]  /root/Загрузки/2011_0719_RT3070_RT3370_RT5370_RT5372_Linux_STA_V2.5.0.3_DPO/os/linux/../../common/cmm_tkip.o
  CC [M]  /root/Загрузки/2011_0719_RT3070_RT3370_RT5370_RT5372_Linux_STA_V2.5.0.3_DPO/os/linux/../../common/cmm_aes.o
  CC [M]  /root/Загрузки/2011_0719_RT3070_RT3370_RT5370_RT5372_Linux_STA_V2.5.0.3_DPO/os/linux/../../common/cmm_sync.o
  CC [M]  /root/Загрузки/2011_0719_RT3070_RT3370_RT5370_RT5372_Linux_STA_V2.5.0.3_DPO/os/linux/../../common/eeprom.o
  CC [M]  /root/Загрузки/2011_0719_RT3070_RT3370_RT5370_RT5372_Linux_STA_V2.5.0.3_DPO/os/linux/../../common/cmm_sanity.o
  CC [M]  /root/Загрузки/2011_0719_RT3070_RT3370_RT5370_RT5372_Linux_STA_V2.5.0.3_DPO/os/linux/../../common/cmm_info.o
  CC [M]  /root/Загрузки/2011_0719_RT3070_RT3370_RT5370_RT5372_Linux_STA_V2.5.0.3_DPO/os/linux/../../common/cmm_cfg.o
  CC [M]  /root/Загрузки/2011_0719_RT3070_RT3370_RT5370_RT5372_Linux_STA_V2.5.0.3_DPO/os/linux/../../common/cmm_wpa.o
In file included from /root/Загрузки/2011_0719_RT3070_RT3370_RT5370_RT5372_Linux_STA_V2.5.0.3_DPO/include/rtmp_os.h:44:0,
                 from /root/Загрузки/2011_0719_RT3070_RT3370_RT5370_RT5372_Linux_STA_V2.5.0.3_DPO/include/rtmp_comm.h:60,
                 from /root/Загрузки/2011_0719_RT3070_RT3370_RT5370_RT5372_Linux_STA_V2.5.0.3_DPO/include/rt_config.h:33,
                 from /root/Загрузки/2011_0719_RT3070_RT3370_RT5370_RT5372_Linux_STA_V2.5.0.3_DPO/os/linux/../../common/cmm_wpa.c:28:
/root/Загрузки/2011_0719_RT3070_RT3370_RT5370_RT5372_Linux_STA_V2.5.0.3_DPO/os/linux/../../common/cmm_wpa.c: In function 'PeerWpaMessageSanity':
/root/Загрузки/2011_0719_RT3070_RT3370_RT5370_RT5372_Linux_STA_V2.5.0.3_DPO/os/linux/../../common/cmm_wpa.c:456:32: warning: argument to 'sizeof' in 'memset' call is the same expression as the destination; did you mean to provide an explicit length? [-Wsizeof-pointer-memaccess]
  NdisZeroMemory(KEYDATA, sizeof(KEYDATA));
                                ^
/root/Загрузки/2011_0719_RT3070_RT3370_RT5370_RT5372_Linux_STA_V2.5.0.3_DPO/include/os/rt_linux.h:469:76: note: in definition of macro 'NdisZeroMemory'
#define NdisZeroMemory(Destination, Length)         memset(Destination, 0, Length)
                                                                            ^
/root/Загрузки/2011_0719_RT3070_RT3370_RT5370_RT5372_Linux_STA_V2.5.0.3_DPO/os/linux/../../common/cmm_wpa.c: In function 'PeerPairMsg4Action':
/root/Загрузки/2011_0719_RT3070_RT3370_RT5370_RT5372_Linux_STA_V2.5.0.3_DPO/os/linux/../../common/cmm_wpa.c:1139:11: warning: unused variable 'group_cipher' [-Wunused-variable]
  UCHAR    group_cipher = Ndis802_11WEPDisabled;
           ^
/root/Загрузки/2011_0719_RT3070_RT3370_RT5370_RT5372_Linux_STA_V2.5.0.3_DPO/os/linux/../../common/cmm_wpa.c: In function 'PeerGroupMsg2Action':
/root/Загрузки/2011_0719_RT3070_RT3370_RT5370_RT5372_Linux_STA_V2.5.0.3_DPO/os/linux/../../common/cmm_wpa.c:1494:11: warning: unused variable 'group_cipher' [-Wunused-variable]
  UCHAR    group_cipher = Ndis802_11WEPDisabled;
           ^
  CC [M]  /root/Загрузки/2011_0719_RT3070_RT3370_RT5370_RT5372_Linux_STA_V2.5.0.3_DPO/os/linux/../../common/dfs.o
  CC [M]  /root/Загрузки/2011_0719_RT3070_RT3370_RT5370_RT5372_Linux_STA_V2.5.0.3_DPO/os/linux/../../common/spectrum.o
  CC [M]  /root/Загрузки/2011_0719_RT3070_RT3370_RT5370_RT5372_Linux_STA_V2.5.0.3_DPO/os/linux/../../common/rtmp_timer.o
  CC [M]  /root/Загрузки/2011_0719_RT3070_RT3370_RT5370_RT5372_Linux_STA_V2.5.0.3_DPO/os/linux/../../common/rt_channel.o
  CC [M]  /root/Загрузки/2011_0719_RT3070_RT3370_RT5370_RT5372_Linux_STA_V2.5.0.3_DPO/os/linux/../../common/cmm_profile.o
  CC [M]  /root/Загрузки/2011_0719_RT3070_RT3370_RT5370_RT5372_Linux_STA_V2.5.0.3_DPO/os/linux/../../common/cmm_asic.o
/root/Загрузки/2011_0719_RT3070_RT3370_RT5370_RT5372_Linux_STA_V2.5.0.3_DPO/os/linux/../../common/cmm_asic.c: In function 'AsicGetAutoAgcOffset':
/root/Загрузки/2011_0719_RT3070_RT3370_RT5370_RT5372_Linux_STA_V2.5.0.3_DPO/os/linux/../../common/cmm_asic.c:939:10: warning: unused variable 'bTempSuccess' [-Wunused-variable]
  BOOLEAN bTempSuccess = FALSE;
          ^
/root/Загрузки/2011_0719_RT3070_RT3370_RT5370_RT5372_Linux_STA_V2.5.0.3_DPO/os/linux/../../common/cmm_asic.c:938:6: warning: unused variable 'LookupTableIndex' [-Wunused-variable]
  INT LookupTableIndex = pAd->TxPowerCtrl.LookupTableIndex + TEMPERATURE_COMPENSATION_LOOKUP_TABLE_OFFSET;
      ^
/root/Загрузки/2011_0719_RT3070_RT3370_RT5370_RT5372_Linux_STA_V2.5.0.3_DPO/os/linux/../../common/cmm_asic.c:937:6: warning: unused variable 'CurrentTemp' [-Wunused-variable]
  INT CurrentTemp = 0;
      ^
/root/Загрузки/2011_0719_RT3070_RT3370_RT5370_RT5372_Linux_STA_V2.5.0.3_DPO/os/linux/../../common/cmm_asic.c:936:8: warning: unused variable 'BbpValue' [-Wunused-variable]
  UCHAR BbpValue = 0;
        ^
/root/Загрузки/2011_0719_RT3070_RT3370_RT5370_RT5372_Linux_STA_V2.5.0.3_DPO/os/linux/../../common/cmm_asic.c:935:32: warning: unused variable 'pTxPowerTuningEntry2' [-Wunused-variable]
  PTX_POWER_TUNING_ENTRY_STRUCT pTxPowerTuningEntry2 = NULL;
                                ^
/root/Загрузки/2011_0719_RT3070_RT3370_RT5370_RT5372_Linux_STA_V2.5.0.3_DPO/os/linux/../../common/cmm_asic.c:932:8: warning: unused variable 'RFValue' [-Wunused-variable]
  UCHAR RFValue = 0;
        ^
/root/Загрузки/2011_0719_RT3070_RT3370_RT5370_RT5372_Linux_STA_V2.5.0.3_DPO/os/linux/../../common/cmm_asic.c:931:32: warning: unused variable 'pTxPowerTuningEntry' [-Wunused-variable]
  PTX_POWER_TUNING_ENTRY_STRUCT pTxPowerTuningEntry = NULL;
                                ^
/root/Загрузки/2011_0719_RT3070_RT3370_RT5370_RT5372_Linux_STA_V2.5.0.3_DPO/os/linux/../../common/cmm_asic.c: In function 'AsicAdjustTxPower':
/root/Загрузки/2011_0719_RT3070_RT3370_RT5370_RT5372_Linux_STA_V2.5.0.3_DPO/os/linux/../../common/cmm_asic.c:1585:20: warning: unused variable 'pFinalTxPwr' [-Wunused-variable]
  PTX_PWR_CFG_STRUC pFinalTxPwr = NULL;
                    ^
/root/Загрузки/2011_0719_RT3070_RT3370_RT5370_RT5372_Linux_STA_V2.5.0.3_DPO/os/linux/../../common/cmm_asic.c:1583:11: warning: unused variable 'bAutoTxAgc' [-Wunused-variable]
  BOOLEAN  bAutoTxAgc = FALSE;
           ^
/root/Загрузки/2011_0719_RT3070_RT3370_RT5370_RT5372_Linux_STA_V2.5.0.3_DPO/os/linux/../../common/cmm_asic.c: In function 'AsicAddPairwiseKeyEntry':
/root/Загрузки/2011_0719_RT3070_RT3370_RT5370_RT5372_Linux_STA_V2.5.0.3_DPO/os/linux/../../common/cmm_asic.c:3187:9: warning: unused variable 'CipherAlg' [-Wunused-variable]
  UCHAR  CipherAlg = pCipherKey->CipherAlg;
         ^
/root/Загрузки/2011_0719_RT3070_RT3370_RT5370_RT5372_Linux_STA_V2.5.0.3_DPO/os/linux/../../common/cmm_asic.c:3184:11: warning: unused variable 'pKey' [-Wunused-variable]
  PUCHAR   pKey = pCipherKey->Key;
           ^
  CC [M]  /root/Загрузки/2011_0719_RT3070_RT3370_RT5370_RT5372_Linux_STA_V2.5.0.3_DPO/os/linux/../../common/cmm_cmd.o
  CC [M]  /root/Загрузки/2011_0719_RT3070_RT3370_RT5370_RT5372_Linux_STA_V2.5.0.3_DPO/os/linux/../../os/linux/rt_profile.o
  CC [M]  /root/Загрузки/2011_0719_RT3070_RT3370_RT5370_RT5372_Linux_STA_V2.5.0.3_DPO/os/linux/../../chips/rtmp_chip.o
  CC [M]  /root/Загрузки/2011_0719_RT3070_RT3370_RT5370_RT5372_Linux_STA_V2.5.0.3_DPO/os/linux/../../sta/assoc.o
  CC [M]  /root/Загрузки/2011_0719_RT3070_RT3370_RT5370_RT5372_Linux_STA_V2.5.0.3_DPO/os/linux/../../sta/auth.o
  CC [M]  /root/Загрузки/2011_0719_RT3070_RT3370_RT5370_RT5372_Linux_STA_V2.5.0.3_DPO/os/linux/../../sta/auth_rsp.o
  CC [M]  /root/Загрузки/2011_0719_RT3070_RT3370_RT5370_RT5372_Linux_STA_V2.5.0.3_DPO/os/linux/../../sta/sync.o
  CC [M]  /root/Загрузки/2011_0719_RT3070_RT3370_RT5370_RT5372_Linux_STA_V2.5.0.3_DPO/os/linux/../../sta/sanity.o
  CC [M]  /root/Загрузки/2011_0719_RT3070_RT3370_RT5370_RT5372_Linux_STA_V2.5.0.3_DPO/os/linux/../../sta/rtmp_data.o
  CC [M]  /root/Загрузки/2011_0719_RT3070_RT3370_RT5370_RT5372_Linux_STA_V2.5.0.3_DPO/os/linux/../../sta/connect.o
  CC [M]  /root/Загрузки/2011_0719_RT3070_RT3370_RT5370_RT5372_Linux_STA_V2.5.0.3_DPO/os/linux/../../sta/wpa.o
  CC [M]  /root/Загрузки/2011_0719_RT3070_RT3370_RT5370_RT5372_Linux_STA_V2.5.0.3_DPO/os/linux/../../sta/ags.o
  CC [M]  /root/Загрузки/2011_0719_RT3070_RT3370_RT5370_RT5372_Linux_STA_V2.5.0.3_DPO/os/linux/../../sta/sta_cfg.o
/root/Загрузки/2011_0719_RT3070_RT3370_RT5370_RT5372_Linux_STA_V2.5.0.3_DPO/os/linux/../../sta/sta_cfg.c:98:12: warning: extra tokens at end of #ifdef directive
#ifdef DBG on line 4095
            ^
/root/Загрузки/2011_0719_RT3070_RT3370_RT5370_RT5372_Linux_STA_V2.5.0.3_DPO/os/linux/../../sta/sta_cfg.c:100:18: warning: extra tokens at end of #endif directive
#endif /* DBG */ on line 4693
                  ^
/root/Загрузки/2011_0719_RT3070_RT3370_RT5370_RT5372_Linux_STA_V2.5.0.3_DPO/os/linux/../../sta/sta_cfg.c: In function 'RTMPIoctlShow':
/root/Загрузки/2011_0719_RT3070_RT3370_RT5370_RT5372_Linux_STA_V2.5.0.3_DPO/os/linux/../../sta/sta_cfg.c:4941:85: error: macro "__DATE__" might prevent reproducible builds [-Werror=date-time]
             snprintf(extra, size, "Driver version-%s, %s %s\n", STA_DRIVER_VERSION, __DATE__, __TIME__ );
                                                                                     ^
/root/Загрузки/2011_0719_RT3070_RT3370_RT5370_RT5372_Linux_STA_V2.5.0.3_DPO/os/linux/../../sta/sta_cfg.c:4941:95: error: macro "__TIME__" might prevent reproducible builds [-Werror=date-time]
             snprintf(extra, size, "Driver version-%s, %s %s\n", STA_DRIVER_VERSION, __DATE__, __TIME__ );
                                                                                               ^
/root/Загрузки/2011_0719_RT3070_RT3370_RT5370_RT5372_Linux_STA_V2.5.0.3_DPO/os/linux/../../sta/sta_cfg.c: In function 'RTMP_STA_IoctlHandle':
/root/Загрузки/2011_0719_RT3070_RT3370_RT5370_RT5372_Linux_STA_V2.5.0.3_DPO/os/linux/../../sta/sta_cfg.c:7286:4: error: implicit declaration of function 'RTMPIoctlMAC' [-Werror=implicit-function-declaration]
    RTMPIoctlMAC(pAd, pRequest);
    ^
/root/Загрузки/2011_0719_RT3070_RT3370_RT5370_RT5372_Linux_STA_V2.5.0.3_DPO/os/linux/../../sta/sta_cfg.c:7290:4: error: implicit declaration of function 'RTMPIoctlE2PROM' [-Werror=implicit-function-declaration]
    RTMPIoctlE2PROM(pAd, pRequest);
    ^
cc1: some warnings being treated as errors
/usr/src/linux-headers-4.0.0-kali1-common/scripts/Makefile.build:263: ошибка выполнения рецепта для цели «/root/Загрузки/2011_0719_RT3070_RT3370_RT5370_RT5372_Linux_STA_V2.5.0.3_DPO/os/linux/../../sta/sta_cfg.o»
make[4]: *** [/root/Загрузки/2011_0719_RT3070_RT3370_RT5370_RT5372_Linux_STA_V2.5.0.3_DPO/os/linux/../../sta/sta_cfg.o] Ошибка 1
/usr/src/linux-headers-4.0.0-kali1-common/Makefile:1407: ошибка выполнения рецепта для цели «_module_/root/Загрузки/2011_0719_RT3070_RT3370_RT5370_RT5372_Linux_STA_V2.5.0.3_DPO/os/linux»
make[3]: *** [_module_/root/Загрузки/2011_0719_RT3070_RT3370_RT5370_RT5372_Linux_STA_V2.5.0.3_DPO/os/linux] Ошибка 2
Makefile:145: ошибка выполнения рецепта для цели «sub-make»
make[2]: *** [sub-make] Ошибка 2
Makefile:8: ошибка выполнения рецепта для цели «all»
make[1]: *** [all] Ошибка 2
make[1]: выход из каталога «/usr/src/linux-headers-4.0.0-kali1-amd64»
Makefile:356: ошибка выполнения рецепта для цели «LINUX»
make: *** [LINUX] Ошибка 2
[/li]
[li][/li]
[/list]

Или надо поместить папку с файлами в другой каконибудь каталог,

ogost

используем тэги для оформления простыней!
в репах есть firmware-ralink, он судя по описанию поддерживает ваше устройство.

ferum

Сочетание
Цитата: kex от 25 декабря 2015, 01:31:282011_0719_RT3070_RT3370_RT5370_RT5372_Linux_STA_V2.5.0.3_DPO
и версия ядра 4.0.0-kali1 вряд ли гармонируют. Ссылки не открываются.
Русские дебианщики против цифрового слабоумия !

kex

#5
ferum, http://askubuntu.com/questions/148767/help-do-i-install-the-ralink-rt3070-wireless-driver
Вот по этому ману пробовал.

Cообщение объединено 25 декабря 2015, 13:35:44

ferum, Вот вывод команды lsusb

  • root@alex:~# lsusb
    Bus 002 Device 002: ID 8087:0024 Intel Corp. Integrated Rate Matching Hub
    Bus 002 Device 001: ID 1d6b:0002 Linux Foundation 2.0 root hub
    Bus 001 Device 004: ID 0489:e04e Foxconn / Hon Hai
    Bus 001 Device 005: ID 148f:3070 Ralink Technology, Corp. RT2870/RT3070 Wireless Adapter
    Bus 001 Device 002: ID 8087:0024 Intel Corp. Integrated Rate Matching Hub
    Bus 001 Device 001: ID 1d6b:0002 Linux Foundation 2.0 root hub
    Bus 004 Device 001: ID 1d6b:0003 Linux Foundation 3.0 root hub
    Bus 003 Device 002: ID 064e:e330 Suyin Corp.
    Bus 003 Device 001: ID 1d6b:0002 Linux Foundation 2.0 root hub

ferum

Русские дебианщики против цифрового слабоумия !

kex

#7
    ferum, Вот так я и устанавливал. Пробовал RT2870 и такая же ошибка. Наверно не дружат эти драйвера с моим ядром. Я уже незнаю куда копать дальше.

    Cообщение объединено 25 декабря 2015, 16:08:59

    ferum, Я тут подумал,может у меня не в драйверах дело, вот вывод reaver

    • root@alex:~# reaver -i wlan1mon -b 90:F6:52:B1:6E:DC   -c 4 -vv -A -L

      Reaver v1.5.2 WiFi Protected Setup Attack Tool
      Copyright (c) 2011, Tactical Network Solutions, Craig Heffner <cheffner@tacnetsol.com>
      mod by t6_x <t6_x@hotmail.com> & DataHead & Soxrok2212

    • Switching wlan1mon to channel 4
    • Waiting for beacon from 90:F6:52:B1:6E:DC
    • Associated with 90:F6:52:B1:6E:DC (ESSID: Sosedi.Ne.shumite)
    • Starting Cracking Session. Pin count: 0, Max pin attempts: 11000
    • Trying pin 12345670.
    • Sending EAPOL START request
      [!] WARNING: Receive timeout occurred
    • Sending EAPOL START request
      [!] WARNING: Receive timeout occurred
    • Sending EAPOL START request
      [!] WARNING: Receive timeout occurred
    • Sending EAPOL START request
    И так до бесконечности. Вставляю TP-LINK и всё сразу работает.Пошёл перебор пин кода.
    Сигнал от точки хороший [/list][/list]

    Cообщение объединено 25 декабря 2015, 17:11:06

    ferum, Я тут на форумах почитал про alfa 036nh у многих такая же проблема с этими адаптерами и никто не добился внятных ответов.Тогда возникает вопрос -зачем  говорят и пишут что этот адаптер очень хорошо подходит для вардрайвинга? Ну опять же я думаю что все дело в драйверах и кстати на старой kali 1.1.0 тоже не работал rever с этим адаптером.

    ferum

    Что вам сказать, драйвер который вы нашли очень стар, для ubuntu 14.04 кто то собрал пакет с dkms , только не заметно что бы он работал. http://ubuntuforums.org/showthread.php?t=2218445&page=2
    Русские дебианщики против цифрового слабоумия !