Автор Тема: проблема сборки  (Прочитано 2302 раз)

0 Пользователей и 1 Гость просматривают эту тему.

Оффлайн Petru-sh.ka

  • Новичок форума
  • Topic Author
  • Сообщений: 7
проблема сборки
« : 08 Февраль 2016, 21:41:15 »
Возникла необходимость установить прожку из ссырцов на Debian 8. В документации все просто ./config -> make -> make install.
На стадии make получил ворох ошибок:
Spoiler: ShowHide
 ./libtool: 5639: ./libtool: libtool_args+= -o: not found
./libtool: 6417: ./libtool: compile_command+= -o: not found
./libtool: 6418: ./libtool: finalize_command+= -o: not found
./libtool: 5639: ./libtool: libtool_args+= ssh: not found
./libtool: 5645: ./libtool: compile_command+= @OUTPUT@: not found
./libtool: 5646: ./libtool: finalize_command+= @OUTPUT@: not found
./libtool: 5639: ./libtool: libtool_args+= ssh.o: not found
./libtool: 6295: ./libtool: objs+= ssh.o: not found
./libtool: 6417: ./libtool: compile_command+= ssh.o: not found
./libtool: 6418: ./libtool: finalize_command+= ssh.o: not found
./libtool: 5639: ./libtool: libtool_args+= readconf.o: not found
./libtool: 6295: ./libtool: objs+= readconf.o: not found
./libtool: 6417: ./libtool: compile_command+= readconf.o: not found
./libtool: 6418: ./libtool: finalize_command+= readconf.o: not found
./libtool: 5639: ./libtool: libtool_args+= clientloop.o: not found
./libtool: 6295: ./libtool: objs+= clientloop.o: not found
./libtool: 6417: ./libtool: compile_command+= clientloop.o: not found
./libtool: 6418: ./libtool: finalize_command+= clientloop.o: not found
./libtool: 5639: ./libtool: libtool_args+= sshtty.o: not found
./libtool: 6295: ./libtool: objs+= sshtty.o: not found
./libtool: 6417: ./libtool: compile_command+= sshtty.o: not found
./libtool: 6418: ./libtool: finalize_command+= sshtty.o: not found
./libtool: 5639: ./libtool: libtool_args+= sshconnect.o: not found
./libtool: 6295: ./libtool: objs+= sshconnect.o: not found
./libtool: 6417: ./libtool: compile_command+= sshconnect.o: not found
./libtool: 6418: ./libtool: finalize_command+= sshconnect.o: not found
./libtool: 5639: ./libtool: libtool_args+= sshconnect1.o: not found
./libtool: 6295: ./libtool: objs+= sshconnect1.o: not found
./libtool: 6417: ./libtool: compile_command+= sshconnect1.o: not found
./libtool: 6418: ./libtool: finalize_command+= sshconnect1.o: not found
./libtool: 5639: ./libtool: libtool_args+= sshconnect2.o: not found
./libtool: 6295: ./libtool: objs+= sshconnect2.o: not found
./libtool: 6417: ./libtool: compile_command+= sshconnect2.o: not found
./libtool: 6418: ./libtool: finalize_command+= sshconnect2.o: not found
./libtool: 5639: ./libtool: libtool_args+= mux.o: not found
./libtool: 6295: ./libtool: objs+= mux.o: not found
./libtool: 6417: ./libtool: compile_command+= mux.o: not found
./libtool: 6418: ./libtool: finalize_command+= mux.o: not found
./libtool: 5639: ./libtool: libtool_args+= roaming_common.o: not found
./libtool: 6295: ./libtool: objs+= roaming_common.o: not found
./libtool: 6417: ./libtool: compile_command+= roaming_common.o: not found
./libtool: 6418: ./libtool: finalize_command+= roaming_common.o: not found
./libtool: 5639: ./libtool: libtool_args+= roaming_client.o: not found
./libtool: 6295: ./libtool: objs+= roaming_client.o: not found
./libtool: 6417: ./libtool: compile_command+= roaming_client.o: not found
./libtool: 6418: ./libtool: finalize_command+= roaming_client.o: not found
./libtool: 5639: ./libtool: libtool_args+= -L.: not found
./libtool: 5999: ./libtool: deplibs+= -L.: not found
./libtool: 6002: ./libtool: lib_search_path+= /home/globus/globus_toolkit-6.0.1453307864/gsi_openssh/source: not found
./libtool: 5639: ./libtool: libtool_args+= -Lopenbsd-compat/: not found
./libtool: 5999: ./libtool: deplibs+= -Lopenbsd-compat/: not found
./libtool: 6002: ./libtool: lib_search_path+= /home/globus/globus_toolkit-6.0.1453307864/gsi_openssh/source/openbsd-compat: not found
./libtool: 5639: ./libtool: libtool_args+= -fstack-protector-all: not found
./libtool: 6417: ./libtool: compile_command+= -fstack-protector-all: not found
./libtool: 6418: ./libtool: finalize_command+= -fstack-protector-all: not found
./libtool: 5639: ./libtool: libtool_args+= -lssh: not found
./libtool: 6060: ./libtool: deplibs+= -lssh: not found
./libtool: 5639: ./libtool: libtool_args+= -lopenbsd-compat: not found
./libtool: 6060: ./libtool: deplibs+= -lopenbsd-compat: not found
./libtool: 5639: ./libtool: libtool_args+= -lcrypto: not found
./libtool: 6060: ./libtool: deplibs+= -lcrypto: not found
./libtool: 5639: ./libtool: libtool_args+= -ldl: not found
./libtool: 6060: ./libtool: deplibs+= -ldl: not found
./libtool: 5639: ./libtool: libtool_args+= -lutil: not found
./libtool: 6060: ./libtool: deplibs+= -lutil: not found
./libtool: 5639: ./libtool: libtool_args+= -lz: not found
./libtool: 6060: ./libtool: deplibs+= -lz: not found
./libtool: 5639: ./libtool: libtool_args+= -lnsl: not found
./libtool: 6060: ./libtool: deplibs+= -lnsl: not found
./libtool: 5639: ./libtool: libtool_args+= -lcrypt: not found
./libtool: 6060: ./libtool: deplibs+= -lcrypt: not found
./libtool: 5639: ./libtool: libtool_args+= -lresolv: not found
./libtool: 6060: ./libtool: deplibs+= -lresolv: not found
./libtool: 5639: ./libtool: libtool_args+= -lpthread: not found
./libtool: 6060: ./libtool: deplibs+= -lpthread: not found
./libtool: 5639: ./libtool: libtool_args+= /home/globus/globus_toolkit-6.0.1453307864/gsi/gss_assist/source/libglobus_gss_assist.la: not found
./libtool: 6401: ./libtool: deplibs+= /home/globus/globus_toolkit-6.0.1453307864/gsi/gss_assist/source/libglobus_gss_assist.la: not found
./libtool: 5639: ./libtool: libtool_args+= /home/globus/globus_toolkit-6.0.1453307864/gsi/gssapi/source/library/libglobus_gssapi_gsi.la: not found
./libtool: 6401: ./libtool: deplibs+= /home/globus/globus_toolkit-6.0.1453307864/gsi/gssapi/source/library/libglobus_gssapi_gsi.la: not found
./libtool: 5639: ./libtool: libtool_args+= /home/globus/globus_toolkit-6.0.1453307864/usage/c/sender/source/libglobus_usage.la: not found
./libtool: 6401: ./libtool: deplibs+= /home/globus/globus_toolkit-6.0.1453307864/usage/c/sender/source/libglobus_usage.la: not found
./libtool: 5639: ./libtool: libtool_args+= /home/globus/globus_toolkit-6.0.1453307864/common/source/library/libglobus_common.la: not found
./libtool: 6401: ./libtool: deplibs+= /home/globus/globus_toolkit-6.0.1453307864/common/source/library/libglobus_common.la: not found
./libtool: 9185: ./libtool: compile_command+= : not found
./libtool: 9186: ./libtool: finalize_command+= : not found
libtool: link: gcc
gcc: fatal error: no input files
compilation terminated.
Makefile:170: ошибка выполнения рецепта для цели «ssh»
make[3]: *** [ssh] Ошибка 4
make[3]: выход из каталога «/home/globus/globus_toolkit-6.0.1453307864/gsi_openssh/source»
Makefile:2748: ошибка выполнения рецепта для цели «gsi_openssh-stamp»
make[2]: *** [gsi_openssh-stamp] Ошибка 1
make[2]: выход из каталога «/home/globus/globus_toolkit-6.0.1453307864»
Makefile:451: ошибка выполнения рецепта для цели «all-recursive»
make[1]: *** [all-recursive] Ошибка 1
make[1]: выход из каталога «/home/globus/globus_toolkit-6.0.1453307864»
Makefile:374: ошибка выполнения рецепта для цели «all»
make: *** [all] Ошибка 2
 


Может кто подсказать в чем проблема?
Заранее благодарю!
 

Оффлайн I-Jurij

  • Местный житель
  • ***
  • Сообщений: 441
  • Slitaz
Re: проблема сборки
« Ответ #1 : 09 Февраль 2016, 01:23:16 »
Так там куча неудовлетворенных зависимостей (dev-файлы ставились?).
И, наверное, не ./config, a ./configure?
 

Оффлайн Petru-sh.ka

  • Новичок форума
  • Topic Author
  • Сообщений: 7
Re: проблема сборки
« Ответ #2 : 09 Февраль 2016, 01:43:20 »
dev-файлы ставились (помню, ибо не первый раз уже пытаюсь). Касательно конфига - сократил в сообщении для удобства.
 

Оффлайн I-Jurij

  • Местный житель
  • ***
  • Сообщений: 441
  • Slitaz
Re: проблема сборки
« Ответ #3 : 09 Февраль 2016, 13:50:45 »
А зачем собирать, если есть готовые пакеты?
По этой инструкции собираете?
 

Оффлайн Petru-sh.ka

  • Новичок форума
  • Topic Author
  • Сообщений: 7
Re: проблема сборки
« Ответ #4 : 09 Февраль 2016, 15:52:03 »
Требование начальства (преподавателя  :) ). Да, делаю по инструкции, все необходимые библиотеки установлены
 

Оффлайн alsoijw

  • Fedora 25 GNOME 3 amd64
  • Ветеран
  • *****
  • Сообщений: 1231
Re: проблема сборки
« Ответ #5 : 09 Февраль 2016, 16:48:37 »
Касательно конфига - сократил в сообщении для удобства.
Как показывате практика вся система сборки часто черезвычайна запутана и подпёрта костылями, которые от малейшего чиха разлетаются во все стороны.
Мало видеть нам начало - надо видеть и конец. Если видишь ты создание - значит где-то есть ТВОРЕЦ
Многие жалуются: геометрия в жизни не пригодилась. Ямб от хорея им приходится отличать ежедневно?
 

Оффлайн Petru-sh.ka

  • Новичок форума
  • Topic Author
  • Сообщений: 7
Re: проблема сборки
« Ответ #6 : 09 Февраль 2016, 17:48:00 »
Касательно конфига - сократил в сообщении для удобства.
Как показывате практика вся система сборки часто черезвычайна запутана и подпёрта костылями, которые от малейшего чиха разлетаются во все стороны.
да, я уже оценил  ;D
 

Оффлайн alsoijw

  • Fedora 25 GNOME 3 amd64
  • Ветеран
  • *****
  • Сообщений: 1231
Re: проблема сборки
« Ответ #7 : 09 Февраль 2016, 19:44:52 »
Petru-sh.ka, скачай в отдельную папку не модифициорванный исходник и повтори.
ЗЫ прочитай меня там есть?
Мало видеть нам начало - надо видеть и конец. Если видишь ты создание - значит где-то есть ТВОРЕЦ
Многие жалуются: геометрия в жизни не пригодилась. Ямб от хорея им приходится отличать ежедневно?
 

Оффлайн Petru-sh.ka

  • Новичок форума
  • Topic Author
  • Сообщений: 7
Re: проблема сборки
« Ответ #8 : 09 Февраль 2016, 21:22:44 »
Увы, результат тот же. Ни Install, ни Readme, ни других намеков на инструкцию увы нету. 
 

Оффлайн alsoijw

  • Fedora 25 GNOME 3 amd64
  • Ветеран
  • *****
  • Сообщений: 1231
Re: проблема сборки
« Ответ #9 : 10 Февраль 2016, 00:11:33 »
Petru-sh.ka, что лежит в корне проекта?
Требование начальства (преподавателя  :) ).
А что это за зверь: задание дал, а как сдлеать не сказал?
Мало видеть нам начало - надо видеть и конец. Если видишь ты создание - значит где-то есть ТВОРЕЦ
Многие жалуются: геометрия в жизни не пригодилась. Ямб от хорея им приходится отличать ежедневно?
 

Оффлайн Petru-sh.ka

  • Новичок форума
  • Topic Author
  • Сообщений: 7
Re: проблема сборки
« Ответ #10 : 10 Февраль 2016, 01:15:47 »
Petru-sh.ka, что лежит в корне проекта?
Вот списочек:
Spoiler: ShowHide
aclocal.m4
build-aux
build.log
callout
common
config.log
config.status
configure
configure.ac
Doxyfile
Doxyfile.in
doxygen
gass
globus_authz_callout_error-stamp
globus_authz-stamp
globus_callout-stamp
globus_common-stamp
globus_ftp_client-stamp
globus_ftp_control-stamp
globus_gass_cache_program-stamp
globus_gass_cache-stamp
globus_gass_copy-stamp
globus_gass_server_ez-stamp
globus_gass_transfer-stamp
globus_gfork-stamp
globus_gram_client-stamp
globus_gram_client_tools-stamp
globus_gram_protocol-stamp
globus_gridftp_server_control-stamp
globus_gridftp_server-stamp
globus_gridmap_callout_error-stamp
globus_gridmap_callout-stamp
globus_gridmap_eppn_callout-stamp
globus_gridmap_verify_myproxy_callout-stamp
globus_gsi_callback-stamp
globus_gsi_cert_utils-stamp
globus_gsi_credential-stamp
globus_gsi_openssl_error-stamp
globus_gsi_proxy_core-stamp
globus_gsi_proxy_ssl-stamp
globus_gsi_sysconfig-stamp
globus_gssapi_error-stamp
globus_gssapi_gsi-stamp
globus_gss_assist-stamp
globus_io-stamp
GLOBUS_LICENSE
globus_net_manager-stamp
globus_openssl_module-stamp
globus_proxy_utils-stamp
globus_rsl-stamp
globus_simple_ca-stamp
globus_usage-stamp
globus-vararg-enums-doxygen-filter.pl
globus-version.inc
globus_xio_gridftp_driver-stamp
globus_xio_gridftp_multicast-stamp
globus_xio_gsi_driver-stamp
globus_xioperf-stamp
globus_xio_pipe_driver-stamp
globus_xio_popen_driver-stamp
globus_xio_rate_driver-stamp
globus_xio-stamp
gram
gridftp
gsi
gsi_openssh
gsi_openssh.gt6.diff
io
libltdl
libltdl-stamp
libtool
ltdlconfig.h
ltdlconfig.h.in
Makefile
Makefile.am
Makefile.in
makefile.targets
myproxy
osx
packaging
prep-gsissh
stamp-h1
usage
xio

Пробовал собрать через automake - результат то же.

Требование начальства (преподавателя  :) ).
А что это за зверь: задание дал, а как сдлеать не сказал?
Нам дали труды товарища armaxis`a
Даже выполняя все на 6-м дебиане (как Он) все-равно получаю такую же проблему.
Ради интереса поставил fedora - тот же результат.
 

Оффлайн alsoijw

  • Fedora 25 GNOME 3 amd64
  • Ветеран
  • *****
  • Сообщений: 1231
Re: проблема сборки
« Ответ #11 : 10 Февраль 2016, 14:27:46 »
Petru-sh.ka, с автором свзатся не пробовал? Я несколько раз пытался собрать устаревший софт. Это либо удавалось с ампутацией части кода либо не удавалось вообще. А разница проста: смена апи. Если с автором связатся не удастся - мучай преподователя.
Мало видеть нам начало - надо видеть и конец. Если видишь ты создание - значит где-то есть ТВОРЕЦ
Многие жалуются: геометрия в жизни не пригодилась. Ямб от хорея им приходится отличать ежедневно?
 

Оффлайн Petru-sh.ka

  • Новичок форума
  • Topic Author
  • Сообщений: 7
Re: проблема сборки
« Ответ #12 : 10 Февраль 2016, 14:44:13 »
Petru-sh.ka, с автором свзатся не пробовал? Я несколько раз пытался собрать устаревший софт. Это либо удавалось с ампутацией части кода либо не удавалось вообще. А разница проста: смена апи. Если с автором связатся не удастся - мучай преподователя.
Да, пожалуй это самая логичная идея
[ot]Благодарю Вас и  I-Jurij за уделенное мне время  :)[/ot]
 

Теги:
 

проблема с libpng14

Автор Brainiac

Ответов: 7
Просмотров: 2348
Последний ответ 17 Февраль 2012, 23:52:02
от Brainiac
Проблема в запуске TOMAHAWK после сборки [РЕШЕНО]

Автор turgon

Ответов: 2
Просмотров: 1495
Последний ответ 16 Март 2016, 12:36:06
от turgon